null
SMILES: Oc1c(O)c2C(=O)c3ccccc3C(=O)c2cc1NS(=O)(=O)c1ccc(cc1)-c1ccccc1
InChI Key: InChIKey=GGJRFYLWAXMCNR-UHFFFAOYSA-N
Activity Spreadsheet -- Enzyme Inhibition Constant Data from BindingDB
Found 1 hit for monomerid = 50266305
Trg + Lig
Ki
nM
ΔG°
kcal/mole
IC50
nM
Kd
nM
EC50/IC50
nM
koff
s-1
kon
M-1s-1
pHTemp
°C
Phosphoglycerate mutase 1
(Homo sapiens (Human))
BDBM50266305
(CHEMBL4741748)
Show SMILES Oc1c(O)c2C(=O)c3ccccc3C(=O)c2cc1NS(=O)(=O)c1ccc(cc1)-c1ccccc1
Show InChI InChI=1S/C28H28N4O4/c1-16-14-23-24(30(3)28(35)29(23)2)15-22(16)32-26(33)19-7-5-6-18-21(9-8-20(25(18)19)27(32)34)31-12-10-17(36-4)11-13-31/h5-9,14-15,17H,10-13H2,1-4H3
n/an/a 250n/an/an/an/an/an/a
TBA
Assay Description
Inhibition of human recombinant PGAM1 by measuring decrease in OD by enzyme based assay
Citation and Details
Article DOI: 10.1016/j.ejmech.2019.01.085
BindingDB Entry DOI: 10.7270/Q2ZS314K