BDBM50266314 CHEMBL4752963
SMILES: Oc1c(O)c2C(=O)c3ccccc3C(=O)c2cc1NS(=O)(=O)c1cccc2ccccc12
InChI Key: InChIKey=UCCATIJMEOLTEL-UHFFFAOYSA-N
Data: 1 IC50
Activity Spreadsheet -- Enzyme Inhibition Constant Data from BindingDB
Found 1 hit for monomerid = 50266314
Trg + Lig
Ki
nM
ΔG°
kcal/mole
IC50
nM
Kd
nM
EC50/IC50
nM
koff
s-1
kon
M-1s-1
pHTemp
°C
Phosphoglycerate mutase 1
(Homo sapiens (Human))
BDBM50266314
(CHEMBL4752963)
Show SMILES Oc1c(O)c2C(=O)c3ccccc3C(=O)c2cc1NS(=O)(=O)c1cccc2ccccc12
Show InChI InChI=1S/C30H34N6O3/c1-19-17-25-26(33(5)30(39)32(25)4)18-24(19)36-28(37)21-8-6-7-20-23(10-9-22(27(20)21)29(36)38)35-15-13-34(14-16-35)12-11-31(2)3/h6-10,17-18H,11-16H2,1-5H3
n/an/a 1.29E+3n/an/an/an/an/an/a
TBA
Citation and Details