null
SMILES: [#7]\[#6](-[#7])=[#7]\[#6]C(F)(F)[#6]-[#6@H](-[#7+])-[#6](-[#8-])=O
InChI Key: InChIKey=DXKWKFPLTJASAU-VKHMYHEASA-N
Activity Spreadsheet -- Enzyme Inhibition Constant Data from BindingDB
Found 1 hit for monomerid = 50266727
Trg + Lig
Ki
nM
ΔG°
kcal/mole
IC50
nM
Kd
nM
EC50/IC50
nM
koff
s-1
kon
M-1s-1
pHTemp
°C
Nitric oxide synthase, inducible
(Homo sapiens (Human))
BDBM50266727
(4,4-Difluoro-L-arginine | CHEMBL476416)
Show SMILES [#7]\[#6](-[#7])=[#7]\[#6]C(F)(F)[#6]-[#6@H](-[#7+])-[#6](-[#8-])=O |r|
Show InChI InChI=1S/C6H12F2N4O2/c7-6(8,2-12-5(10)11)1-3(9)4(13)14/h3H,1-2,9H2,(H,13,14)(H4,10,11,12)/t3-/m0/s1
NCI pathway
Reactome pathway
n/an/an/a 3.10E+6n/an/an/an/an/a
University of Utrecht
Curated by ChEMBL
Assay Description
Binding affinity to iNOS with heme domain construct (unknown origin) assessed as spectral binding constant by spectral assay
Bioorg Med Chem Lett 19: 1758-62 (2009)
Article DOI: 10.1016/j.bmcl.2009.01.076
BindingDB Entry DOI: 10.7270/Q2P55NC7