BDBM50266811 CHEMBL4059919
SMILES: Cl.NCc1cc(Oc2cccc(c2)C(=O)Nc2ccccc2)nc(c1)C(F)(F)F
InChI Key: InChIKey=HAEQAUJYNHQVHV-UHFFFAOYSA-N
Data: 4 IC50
Activity Spreadsheet -- Enzyme Inhibition Constant Data from BindingDB
Found 4 hits for monomerid = 50266811
Trg + Lig
Ki
nM
ΔG°
kcal/mole
IC50
nM
Kd
nM
EC50/IC50
nM
koff
s-1
kon
M-1s-1
pHTemp
°C
Lysyl oxidase homolog 2
(Homo sapiens (Human))
BDBM50266811
(CHEMBL4059919)
Show SMILES Cl.NCc1cc(Oc2cccc(c2)C(=O)Nc2ccccc2)nc(c1)C(F)(F)F
Show InChI InChI=1S/C20H16F3N3O2/c21-20(22,23)17-9-13(12-24)10-18(26-17)28-16-8-4-5-14(11-16)19(27)25-15-6-2-1-3-7-15/h1-11H,12,24H2,(H,25,27)
n/an/a 2.90E+3n/an/an/an/an/an/a
PharmAkea Therapeutics
Curated by ChEMBL
Assay Description
Inhibition of recombinant human LOXL2 expressed in human whole blood assessed as reduction of H2O2 production from oxidative deamination of DAP prein...
J Med Chem 60: 4403-4423 (2017)
Article DOI: 10.1021/acs.jmedchem.7b00345
BindingDB Entry DOI: 10.7270/Q2QV3Q0K
Lysyl oxidase
(Homo sapiens (Human))
BDBM50266811
(CHEMBL4059919)
Show SMILES Cl.NCc1cc(Oc2cccc(c2)C(=O)Nc2ccccc2)nc(c1)C(F)(F)F
Show InChI InChI=1S/C20H16F3N3O2/c21-20(22,23)17-9-13(12-24)10-18(26-17)28-16-8-4-5-14(11-16)19(27)25-15-6-2-1-3-7-15/h1-11H,12,24H2,(H,25,27)
Reactome pathway
n/an/a 1.10E+4n/an/an/an/an/an/a
PharmAkea Therapeutics
Curated by ChEMBL
Assay Description
Inhibition of human LOX expressed in HEK cells assessed as reduction of H2O2 production from oxidative deamination of DAP preincubated for 2 hrs foll...
J Med Chem 60: 4403-4423 (2017)
Article DOI: 10.1021/acs.jmedchem.7b00345
BindingDB Entry DOI: 10.7270/Q2QV3Q0K
Lysyl oxidase homolog 2
(Homo sapiens (Human))
BDBM50266811
(CHEMBL4059919)
Show SMILES Cl.NCc1cc(Oc2cccc(c2)C(=O)Nc2ccccc2)nc(c1)C(F)(F)F
Show InChI InChI=1S/C20H16F3N3O2/c21-20(22,23)17-9-13(12-24)10-18(26-17)28-16-8-4-5-14(11-16)19(27)25-15-6-2-1-3-7-15/h1-11H,12,24H2,(H,25,27)
n/an/a 42n/an/an/an/an/an/a
PharmAkea Therapeutics
Curated by ChEMBL
Assay Description
Inhibition of human LOXL2 expressed in CHO cells assessed as reduction of H2O2 production from oxidative deamination of DAP preincubated for 2 hrs fo...
J Med Chem 60: 4403-4423 (2017)
Article DOI: 10.1021/acs.jmedchem.7b00345
BindingDB Entry DOI: 10.7270/Q2QV3Q0K
Lysyl oxidase homolog 2
(Homo sapiens (Human))
BDBM50266811
(CHEMBL4059919)
Show SMILES Cl.NCc1cc(Oc2cccc(c2)C(=O)Nc2ccccc2)nc(c1)C(F)(F)F
Show InChI InChI=1S/C20H16F3N3O2/c21-20(22,23)17-9-13(12-24)10-18(26-17)28-16-8-4-5-14(11-16)19(27)25-15-6-2-1-3-7-15/h1-11H,12,24H2,(H,25,27)
n/an/a 62n/an/an/an/an/an/a
PharmAkea Therapeutics
Curated by ChEMBL
Assay Description
Inhibition of human LOXL2 expressed in CHO cells assessed as reduction of H2O2 production from oxidative deamination of DAP preincubated for 2 hrs fo...
J Med Chem 60: 4403-4423 (2017)
Article DOI: 10.1021/acs.jmedchem.7b00345
BindingDB Entry DOI: 10.7270/Q2QV3Q0K