null
SMILES: COc1ccc(Oc2ccc(cc2)N2C[C@H](C[C@H]2CC(O)=O)C(F)(F)F)c(C)c1
InChI Key: InChIKey=QQODPVZSTBGMNP-HOCLYGCPSA-N
Activity Spreadsheet -- Enzyme Inhibition Constant Data from BindingDB
Found 3 hits for monomerid = 50267029
Trg + Lig
Ki
nM
ΔG°
kcal/mole
IC50
nM
Kd
nM
EC50/IC50
nM
koff
s-1
kon
M-1s-1
pHTemp
°C
Free fatty acid receptor 1
(Homo sapiens (Human))
BDBM50267029
(CHEMBL4069191)
Show SMILES COc1ccc(Oc2ccc(cc2)N2C[C@H](C[C@H]2CC(O)=O)C(F)(F)F)c(C)c1 |r|
Show InChI InChI=1S/C21H22F3NO4/c1-13-9-18(28-2)7-8-19(13)29-17-5-3-15(4-6-17)25-12-14(21(22,23)24)10-16(25)11-20(26)27/h3-9,14,16H,10-12H2,1-2H3,(H,26,27)/t14-,16-/m0/s1
39n/an/an/an/an/an/an/an/a
Bristol-Myers Squibb
Curated by ChEMBL
Assay Description
Binding affinity to human GPR40 expressed in HEK293 cell membranes after 1 hr by radioligand displacement based scintillation counting method
J Med Chem 60: 1417-1431 (2017)
Article DOI: 10.1021/acs.jmedchem.6b01559
BindingDB Entry DOI: 10.7270/Q25X2CD5
Free fatty acid receptor 1
(Mus musculus)
BDBM50267029
(CHEMBL4069191)
Show SMILES COc1ccc(Oc2ccc(cc2)N2C[C@H](C[C@H]2CC(O)=O)C(F)(F)F)c(C)c1 |r|
Show InChI InChI=1S/C21H22F3NO4/c1-13-9-18(28-2)7-8-19(13)29-17-5-3-15(4-6-17)25-12-14(21(22,23)24)10-16(25)11-20(26)27/h3-9,14,16H,10-12H2,1-2H3,(H,26,27)/t14-,16-/m0/s1
Reactome pathway
n/an/an/an/a 170n/an/an/an/a
Bristol-Myers Squibb
Curated by ChEMBL
Assay Description
Agonist activity at GPR40 in mouse STC1 cells assessed as induction of GLP-1 secretion measured after 1 hr by HTRF assay
J Med Chem 60: 1417-1431 (2017)
Article DOI: 10.1021/acs.jmedchem.6b01559
BindingDB Entry DOI: 10.7270/Q25X2CD5
Free fatty acid receptor 1
(Homo sapiens (Human))
BDBM50267029
(CHEMBL4069191)
Show SMILES COc1ccc(Oc2ccc(cc2)N2C[C@H](C[C@H]2CC(O)=O)C(F)(F)F)c(C)c1 |r|
Show InChI InChI=1S/C21H22F3NO4/c1-13-9-18(28-2)7-8-19(13)29-17-5-3-15(4-6-17)25-12-14(21(22,23)24)10-16(25)11-20(26)27/h3-9,14,16H,10-12H2,1-2H3,(H,26,27)/t14-,16-/m0/s1
n/an/an/an/a 55n/an/an/an/a
Bristol-Myers Squibb
Curated by ChEMBL
Assay Description
Agonist activity at human GPR40 expressed in CHO-A12 cells assessed as increase in intracellular calcium flux measured for 100 secs by FLIPR assay
J Med Chem 60: 1417-1431 (2017)
Article DOI: 10.1021/acs.jmedchem.6b01559
BindingDB Entry DOI: 10.7270/Q25X2CD5