null
SMILES: CC(C)n1cnc2c(nc(NCCO)nc12)N(C)c1cccc(Cl)c1
InChI Key: InChIKey=BMUXNLKQMJEFGS-UHFFFAOYSA-N
Activity Spreadsheet -- Enzyme Inhibition Constant Data from BindingDB
Found 5 hits for monomerid = 50267719
Trg + Lig
Ki
nM
ΔG°
kcal/mole
IC50
nM
Kd
nM
EC50/IC50
nM
koff
s-1
kon
M-1s-1
pHTemp
°C
Cyclin-dependent kinase 1
(Saccharomyces cerevisiae)
BDBM50267719
(2-(6-((3-chlorophenyl)(methyl)amino)-9-isopropyl-9...)
Show SMILES CC(C)n1cnc2c(nc(NCCO)nc12)N(C)c1cccc(Cl)c1
Show InChI InChI=1S/C17H21ClN6O/c1-11(2)24-10-20-14-15(21-17(19-7-8-25)22-16(14)24)23(3)13-6-4-5-12(18)9-13/h4-6,9-11,25H,7-8H2,1-3H3,(H,19,21,22)
Reactome pathway
n/an/a>5.00E+5n/an/an/an/an/an/a
University of California
Curated by ChEMBL
Assay Description
Inhibition of yeast W303 cdc28 phosphorylation assessed as [32P] incorporation in histone H1 from [gamma32P]ATP by scintillation counting
Science 281: 533-538 (1998)
BindingDB Entry DOI: 10.7270/Q28G8MMG
Cyclin-dependent protein kinase PHO85
(Saccharomyces cerevisiae)
BDBM50267719
(2-(6-((3-chlorophenyl)(methyl)amino)-9-isopropyl-9...)
Show SMILES CC(C)n1cnc2c(nc(NCCO)nc12)N(C)c1cccc(Cl)c1
Show InChI InChI=1S/C17H21ClN6O/c1-11(2)24-10-20-14-15(21-17(19-7-8-25)22-16(14)24)23(3)13-6-4-5-12(18)9-13/h4-6,9-11,25H,7-8H2,1-3H3,(H,19,21,22)
n/an/a>5.00E+5n/an/an/an/an/an/a
University of California
Curated by ChEMBL
Assay Description
Inhibition of yeast W303 Pho85 phosphorylation assessed as [32P] incorporation in histone H1 from [gamma32P]ATP by scintillation counting
Science 281: 533-538 (1998)
BindingDB Entry DOI: 10.7270/Q28G8MMG
Serine/threonine-protein kinase CAK1
(Saccharomyces cerevisiae)
BDBM50267719
(2-(6-((3-chlorophenyl)(methyl)amino)-9-isopropyl-9...)
Show SMILES CC(C)n1cnc2c(nc(NCCO)nc12)N(C)c1cccc(Cl)c1
Show InChI InChI=1S/C17H21ClN6O/c1-11(2)24-10-20-14-15(21-17(19-7-8-25)22-16(14)24)23(3)13-6-4-5-12(18)9-13/h4-6,9-11,25H,7-8H2,1-3H3,(H,19,21,22)
n/an/a>5.00E+5n/an/an/an/an/an/a
University of California
Curated by ChEMBL
Assay Description
Inhibition of yeast W303 Cak1 phosphorylation assessed as [32P] incorporation in histone H1 from [gamma32P]ATP by scintillation counting
Science 281: 533-538 (1998)
BindingDB Entry DOI: 10.7270/Q28G8MMG
Meiotic mRNA stability protein kinase SSN3
(Saccharomyces cerevisiae)
BDBM50267719
(2-(6-((3-chlorophenyl)(methyl)amino)-9-isopropyl-9...)
Show SMILES CC(C)n1cnc2c(nc(NCCO)nc12)N(C)c1cccc(Cl)c1
Show InChI InChI=1S/C17H21ClN6O/c1-11(2)24-10-20-14-15(21-17(19-7-8-25)22-16(14)24)23(3)13-6-4-5-12(18)9-13/h4-6,9-11,25H,7-8H2,1-3H3,(H,19,21,22)
n/an/a>5.00E+5n/an/an/an/an/an/a
University of California
Curated by ChEMBL
Assay Description
Inhibition of yeast W303 Srb10 phosphorylation assessed as [32P] incorporation in histone H1 from [gamma32P]ATP by scintillation counting
Science 281: 533-538 (1998)
BindingDB Entry DOI: 10.7270/Q28G8MMG
Serine/threonine-protein kinase KIN28
(Saccharomyces cerevisiae)
BDBM50267719
(2-(6-((3-chlorophenyl)(methyl)amino)-9-isopropyl-9...)
Show SMILES CC(C)n1cnc2c(nc(NCCO)nc12)N(C)c1cccc(Cl)c1
Show InChI InChI=1S/C17H21ClN6O/c1-11(2)24-10-20-14-15(21-17(19-7-8-25)22-16(14)24)23(3)13-6-4-5-12(18)9-13/h4-6,9-11,25H,7-8H2,1-3H3,(H,19,21,22)
Reactome pathway
n/an/a>5.00E+5n/an/an/an/an/an/a
University of California
Curated by ChEMBL
Assay Description
Inhibition of yeast W303 Kin28 phosphorylation assessed as [32P] incorporation in histone H1 from [gamma32P]ATP by scintillation counting
Science 281: 533-538 (1998)
BindingDB Entry DOI: 10.7270/Q28G8MMG