BDBM50267811 4-(Hydroxy{bis[4-(methyloxy)phenyl]}methyl)-1-{2-[(phenylmethyl)oxy]ethyl}-1-azoniabicyclo[2.2.2]octane Bromide::CHEMBL521921
SMILES: COc1ccc(cc1)C(O)(c1ccc(OC)cc1)C12CC[N+](CCOCc3ccccc3)(CC1)CC2
InChI Key: InChIKey=CUFRILWCLMBUGS-UHFFFAOYSA-N
Data: 1 IC50
Activity Spreadsheet -- Enzyme Inhibition Constant Data from BindingDB
Found 1 hit for monomerid = 50267811
Trg + Lig
Ki
nM
ΔG°
kcal/mole
IC50
nM
Kd
nM
EC50/IC50
nM
koff
s-1
kon
M-1s-1
pHTemp
°C
Muscarinic acetylcholine receptor M3
(Homo sapiens (Human))
BDBM50267811
(4-(Hydroxy{bis[4-(methyloxy)phenyl]}methyl)-1-{2-[...)
Show SMILES COc1ccc(cc1)C(O)(c1ccc(OC)cc1)C12CC[N+](CCOCc3ccccc3)(CC1)CC2
Show InChI InChI=1S/C31H38NO4/c1-34-28-12-8-26(9-13-28)31(33,27-10-14-29(35-2)15-11-27)30-16-19-32(20-17-30,21-18-30)22-23-36-24-25-6-4-3-5-7-25/h3-15,33H,16-24H2,1-2H3/q+1
Reactome pathway
n/an/a 3.60E+4n/an/an/an/an/an/a
GlaxoSmithKline
Curated by ChEMBL
Assay Description
Antagonist activity at human cloned muscarinic M3 receptor expressed in CHO cells assessed as inhibition of acetylcholine-induced calcium mobilizatio...
J Med Chem 52: 2493-505 (2009)
Article DOI: 10.1021/jm801601v
BindingDB Entry DOI: 10.7270/Q2H131X8