BDBM50267823 3-(3-(trifluoromethyl)-5-(4-((1R,2R)-2-(4-(trifluoromethyl)phenyl)cyclopropanecarbonyl)piperazin-1-ylsulfonyl)phenyl)-1,2,4-oxadiazol-5(4H)-one::CHEMBL520078
SMILES: FC(F)(F)c1ccc(cc1)[C@@H]1C[C@H]1C(=O)N1CCN(CC1)S(=O)(=O)c1cc(cc(c1)C(F)(F)F)-c1nc(=O)o[nH]1
InChI Key: InChIKey=CGKBQNDTELRHHP-RBUKOAKNSA-N
Data: 2 IC50
Activity Spreadsheet -- Enzyme Inhibition Constant Data from BindingDB
Found 2 hits for monomerid = 50267823
Trg + Lig
Ki
nM
ΔG°
kcal/mole
IC50
nM
Kd
nM
EC50/IC50
nM
koff
s-1
kon
M-1s-1
pHTemp
°C
Cannabinoid receptor 2
(Homo sapiens (Human))
BDBM50267823
(3-(3-(trifluoromethyl)-5-(4-((1R,2R)-2-(4-(trifluo...)
Show SMILES FC(F)(F)c1ccc(cc1)[C@@H]1C[C@H]1C(=O)N1CCN(CC1)S(=O)(=O)c1cc(cc(c1)C(F)(F)F)-c1nc(=O)o[nH]1 |r|
Show InChI InChI=1S/C24H20F6N4O5S/c25-23(26,27)15-3-1-13(2-4-15)18-12-19(18)21(35)33-5-7-34(8-6-33)40(37,38)17-10-14(20-31-22(36)39-32-20)9-16(11-17)24(28,29)30/h1-4,9-11,18-19H,5-8,12H2,(H,31,32,36)/t18-,19+/m0/s1
Reactome pathway
n/an/a>1.00E+4n/an/an/an/an/an/a
Merck Research Laboratories
Curated by ChEMBL
Assay Description
Displacement of [3H]CP55940 from human recombinant CB2R expressed in CHO cells
J Med Chem 52: 2550-8 (2009)
Article DOI: 10.1021/jm900063x
BindingDB Entry DOI: 10.7270/Q2028RF8
Cannabinoid receptor 1
(Homo sapiens (Human))
BDBM50267823
(3-(3-(trifluoromethyl)-5-(4-((1R,2R)-2-(4-(trifluo...)
Show SMILES FC(F)(F)c1ccc(cc1)[C@@H]1C[C@H]1C(=O)N1CCN(CC1)S(=O)(=O)c1cc(cc(c1)C(F)(F)F)-c1nc(=O)o[nH]1 |r|
Show InChI InChI=1S/C24H20F6N4O5S/c25-23(26,27)15-3-1-13(2-4-15)18-12-19(18)21(35)33-5-7-34(8-6-33)40(37,38)17-10-14(20-31-22(36)39-32-20)9-16(11-17)24(28,29)30/h1-4,9-11,18-19H,5-8,12H2,(H,31,32,36)/t18-,19+/m0/s1
NCI pathway
Reactome pathway
n/an/a 200n/an/an/an/an/an/a
Merck Research Laboratories
Curated by ChEMBL
Assay Description
Displacement of [3H]CP55940 from human recombinant CB1R expressed in CHO cells
J Med Chem 52: 2550-8 (2009)
Article DOI: 10.1021/jm900063x
BindingDB Entry DOI: 10.7270/Q2028RF8