BDBM50267848 CHEMBL4091582
SMILES: C[C@]1(N)CC[C@@H](Nc2c(cnn3cc(cc23)-c2ccc(cc2)C#N)C(N)=O)C1(C)C
InChI Key: InChIKey=BMXQAKOQKCSXGC-XXBNENTESA-N
Data: 6 IC50
Activity Spreadsheet -- Enzyme Inhibition Constant Data from BindingDB
Found 6 hits for monomerid = 50267848
Trg + Lig
Ki
nM
ΔG°
kcal/mole
IC50
nM
Kd
nM
EC50/IC50
nM
koff
s-1
kon
M-1s-1
pHTemp
°C
Tyrosine-protein kinase JAK2
(Homo sapiens (Human))
BDBM50267848
(CHEMBL4091582)
Show SMILES C[C@]1(N)CC[C@@H](Nc2c(cnn3cc(cc23)-c2ccc(cc2)C#N)C(N)=O)C1(C)C |r|
Show InChI InChI=1S/C23H26N6O/c1-22(2)19(8-9-23(22,3)26)28-20-17(21(25)30)12-27-29-13-16(10-18(20)29)15-6-4-14(11-24)5-7-15/h4-7,10,12-13,19,28H,8-9,26H2,1-3H3,(H2,25,30)/t19-,23+/m1/s1
Reactome pathway
n/an/a 7.30n/an/an/an/an/an/a
Research and Development, Bristol-Myers Squibb Research and Development, P.O. Box 4000, Princeton, NJ 08543, USA. Electronic address: john.hynes@bms.com.
Curated by ChEMBL
Assay Description
Inhibition of GST-tagged JAK2 (unknown origin) after 3 hrs by Caliper assay
Bioorg Med Chem Lett 27: 3101-3106 (2017)
Article DOI: 10.1016/j.bmcl.2017.05.043
BindingDB Entry DOI: 10.7270/Q2G73H7V
Tyrosine-protein kinase JAK3
(Homo sapiens (Human))
BDBM50267848
(CHEMBL4091582)
Show SMILES C[C@]1(N)CC[C@@H](Nc2c(cnn3cc(cc23)-c2ccc(cc2)C#N)C(N)=O)C1(C)C |r|
Show InChI InChI=1S/C23H26N6O/c1-22(2)19(8-9-23(22,3)26)28-20-17(21(25)30)12-27-29-13-16(10-18(20)29)15-6-4-14(11-24)5-7-15/h4-7,10,12-13,19,28H,8-9,26H2,1-3H3,(H2,25,30)/t19-,23+/m1/s1
Reactome pathway
n/an/a 1n/an/an/an/an/an/a
Research and Development, Bristol-Myers Squibb Research and Development, P.O. Box 4000, Princeton, NJ 08543, USA. Electronic address: john.hynes@bms.com.
Curated by ChEMBL
Assay Description
Inhibition of JAK3 (unknown origin) using CSKtide as substrate after 30 mins in presence of [gamma33P]ATP by liquid scintillation counting method
Bioorg Med Chem Lett 27: 3101-3106 (2017)
Article DOI: 10.1016/j.bmcl.2017.05.043
BindingDB Entry DOI: 10.7270/Q2G73H7V
JAK3/JAK1
(Homo sapiens (Human))
BDBM50267848
(CHEMBL4091582)
Show SMILES C[C@]1(N)CC[C@@H](Nc2c(cnn3cc(cc23)-c2ccc(cc2)C#N)C(N)=O)C1(C)C |r|
Show InChI InChI=1S/C23H26N6O/c1-22(2)19(8-9-23(22,3)26)28-20-17(21(25)30)12-27-29-13-16(10-18(20)29)15-6-4-14(11-24)5-7-15/h4-7,10,12-13,19,28H,8-9,26H2,1-3H3,(H2,25,30)/t19-,23+/m1/s1
n/an/a 66n/an/an/an/an/an/a
Research and Development, Bristol-Myers Squibb Research and Development, P.O. Box 4000, Princeton, NJ 08543, USA. Electronic address: john.hynes@bms.com.
Curated by ChEMBL
Assay Description
Inhibition of JAK1/JAK3 in human whole blood assessed as reduction in IL-2 induced IFN-gamma production after 18 hrs by ELISA
Bioorg Med Chem Lett 27: 3101-3106 (2017)
Article DOI: 10.1016/j.bmcl.2017.05.043
BindingDB Entry DOI: 10.7270/Q2G73H7V
Non-receptor tyrosine-protein kinase TYK2
(Homo sapiens (Human))
BDBM50267848
(CHEMBL4091582)
Show SMILES C[C@]1(N)CC[C@@H](Nc2c(cnn3cc(cc23)-c2ccc(cc2)C#N)C(N)=O)C1(C)C |r|
Show InChI InChI=1S/C23H26N6O/c1-22(2)19(8-9-23(22,3)26)28-20-17(21(25)30)12-27-29-13-16(10-18(20)29)15-6-4-14(11-24)5-7-15/h4-7,10,12-13,19,28H,8-9,26H2,1-3H3,(H2,25,30)/t19-,23+/m1/s1
n/an/a 8.60n/an/an/an/an/an/a
Research and Development, Bristol-Myers Squibb Research and Development, P.O. Box 4000, Princeton, NJ 08543, USA. Electronic address: john.hynes@bms.com.
Curated by ChEMBL
Assay Description
Inhibition of His-tagged TYK2 (unknown origin) after 3 hrs by Caliper assay
Bioorg Med Chem Lett 27: 3101-3106 (2017)
Article DOI: 10.1016/j.bmcl.2017.05.043
BindingDB Entry DOI: 10.7270/Q2G73H7V
Potassium voltage-gated channel subfamily H member 2
(Homo sapiens (Human))
BDBM50267848
(CHEMBL4091582)
Show SMILES C[C@]1(N)CC[C@@H](Nc2c(cnn3cc(cc23)-c2ccc(cc2)C#N)C(N)=O)C1(C)C |r|
Show InChI InChI=1S/C23H26N6O/c1-22(2)19(8-9-23(22,3)26)28-20-17(21(25)30)12-27-29-13-16(10-18(20)29)15-6-4-14(11-24)5-7-15/h4-7,10,12-13,19,28H,8-9,26H2,1-3H3,(H2,25,30)/t19-,23+/m1/s1
Reactome pathway
n/an/a 1.20E+4n/an/an/an/an/an/a
Research and Development, Bristol-Myers Squibb Research and Development, P.O. Box 4000, Princeton, NJ 08543, USA. Electronic address: john.hynes@bms.com.
Curated by ChEMBL
Assay Description
Inhibition of human ERG by flux-based assay
Bioorg Med Chem Lett 27: 3101-3106 (2017)
Article DOI: 10.1016/j.bmcl.2017.05.043
BindingDB Entry DOI: 10.7270/Q2G73H7V
Tyrosine-protein kinase JAK1
(Homo sapiens (Human))
BDBM50267848
(CHEMBL4091582)
Show SMILES C[C@]1(N)CC[C@@H](Nc2c(cnn3cc(cc23)-c2ccc(cc2)C#N)C(N)=O)C1(C)C |r|
Show InChI InChI=1S/C23H26N6O/c1-22(2)19(8-9-23(22,3)26)28-20-17(21(25)30)12-27-29-13-16(10-18(20)29)15-6-4-14(11-24)5-7-15/h4-7,10,12-13,19,28H,8-9,26H2,1-3H3,(H2,25,30)/t19-,23+/m1/s1
Reactome pathway
n/an/a 0.900n/an/an/an/an/an/a
Research and Development, Bristol-Myers Squibb Research and Development, P.O. Box 4000, Princeton, NJ 08543, USA. Electronic address: john.hynes@bms.com.
Curated by ChEMBL
Assay Description
Inhibition of GST-tagged JAK1 (unknown origin) after 3 hrs by Caliper assay
Bioorg Med Chem Lett 27: 3101-3106 (2017)
Article DOI: 10.1016/j.bmcl.2017.05.043
BindingDB Entry DOI: 10.7270/Q2G73H7V