BDBM50267865 (4Z)-6-Iodo-4-{[(3-hydroxy-4-methoxybenzyl)amino]methylene}isoquinoline-1,3(2H,4H)-dione::CHEMBL489245
SMILES: COc1ccc(CNC=C2C(=O)NC(=O)c3ccc(I)cc23)cc1O
InChI Key: InChIKey=QLYIMJWTTWQOSZ-UHFFFAOYSA-N
Data: 3 IC50
Activity Spreadsheet -- Enzyme Inhibition Constant Data from BindingDB
Found 3 hits for monomerid = 50267865
Trg + Lig
Ki
nM
ΔG°
kcal/mole
IC50
nM
Kd
nM
EC50/IC50
nM
koff
s-1
kon
M-1s-1
pHTemp
°C
Cyclin-dependent kinase 2
(Homo sapiens (Human))
BDBM50267865
((4Z)-6-Iodo-4-{[(3-hydroxy-4-methoxybenzyl)amino]m...)
Show SMILES COc1ccc(CNC=C2C(=O)NC(=O)c3ccc(I)cc23)cc1O |w:8.7|
Show InChI InChI=1S/C18H15IN2O4/c1-25-16-5-2-10(6-15(16)22)8-20-9-14-13-7-11(19)3-4-12(13)17(23)21-18(14)24/h2-7,9,20,22H,8H2,1H3,(H,21,23,24)
NCI pathway
Reactome pathway
n/an/a 870n/an/an/an/an/an/a
Wyeth Research
Curated by ChEMBL
Assay Description
Inhibition of CDK2/Cyclin E (unknown origin) assessed as inhibition of retinoblastoma susceptibility gene product phosphorylation
J Med Chem 52: 2289-310 (2009)
Article DOI: 10.1021/jm801026e
BindingDB Entry DOI: 10.7270/Q27H1JG7
Cyclin-dependent kinase 4
(Homo sapiens (Human))
BDBM50267865
((4Z)-6-Iodo-4-{[(3-hydroxy-4-methoxybenzyl)amino]m...)
Show SMILES COc1ccc(CNC=C2C(=O)NC(=O)c3ccc(I)cc23)cc1O |w:8.7|
Show InChI InChI=1S/C18H15IN2O4/c1-25-16-5-2-10(6-15(16)22)8-20-9-14-13-7-11(19)3-4-12(13)17(23)21-18(14)24/h2-7,9,20,22H,8H2,1H3,(H,21,23,24)
NCI pathway
Reactome pathway
n/an/a 10n/an/an/an/an/an/a
Wyeth Research
Curated by ChEMBL
Assay Description
Inhibition of CDK4/Cyclin D1 (unknown origin) assessed as inhibition of retinoblastoma susceptibility gene product phosphorylation
J Med Chem 52: 2289-310 (2009)
Article DOI: 10.1021/jm801026e
BindingDB Entry DOI: 10.7270/Q27H1JG7
Cyclin-dependent kinase 1
(Homo sapiens (Human))
BDBM50267865
((4Z)-6-Iodo-4-{[(3-hydroxy-4-methoxybenzyl)amino]m...)
Show SMILES COc1ccc(CNC=C2C(=O)NC(=O)c3ccc(I)cc23)cc1O |w:8.7|
Show InChI InChI=1S/C18H15IN2O4/c1-25-16-5-2-10(6-15(16)22)8-20-9-14-13-7-11(19)3-4-12(13)17(23)21-18(14)24/h2-7,9,20,22H,8H2,1H3,(H,21,23,24)
Reactome pathway
n/an/a 6.00E+3n/an/an/an/an/an/a
Wyeth Research
Curated by ChEMBL
Assay Description
Inhibition of CDK1/Cyclin B1 (unknown origin) assessed as inhibition of retinoblastoma susceptibility gene product phosphorylation
J Med Chem 52: 2289-310 (2009)
Article DOI: 10.1021/jm801026e
BindingDB Entry DOI: 10.7270/Q27H1JG7