BDBM50267900 4-[(3-Hydroxy-4-methoxy-benzylamino)-methylene]-6-phenyl-4H-isoquinoline-1,3-dione::CHEMBL523780
SMILES: COc1ccc(CNC=C2C(=O)NC(=O)c3ccc(cc23)-c2ccccc2)cc1O
InChI Key: InChIKey=DLCGBOHXHSAWKY-UHFFFAOYSA-N
Data: 3 IC50
Activity Spreadsheet -- Enzyme Inhibition Constant Data from BindingDB
Found 3 hits for monomerid = 50267900
Trg + Lig
Ki
nM
ΔG°
kcal/mole
IC50
nM
Kd
nM
EC50/IC50
nM
koff
s-1
kon
M-1s-1
pHTemp
°C
Cyclin-dependent kinase 2
(Homo sapiens (Human))
BDBM50267900
(4-[(3-Hydroxy-4-methoxy-benzylamino)-methylene]-6-...)
Show SMILES COc1ccc(CNC=C2C(=O)NC(=O)c3ccc(cc23)-c2ccccc2)cc1O |w:8.7|
Show InChI InChI=1S/C24H20N2O4/c1-30-22-10-7-15(11-21(22)27)13-25-14-20-19-12-17(16-5-3-2-4-6-16)8-9-18(19)23(28)26-24(20)29/h2-12,14,25,27H,13H2,1H3,(H,26,28,29)
NCI pathway
Reactome pathway
n/an/a<2.59E+4n/an/an/an/an/an/a
Wyeth Research
Curated by ChEMBL
Assay Description
Inhibition of CDK2/Cyclin E (unknown origin) assessed as inhibition of retinoblastoma susceptibility gene product phosphorylation
J Med Chem 52: 2289-310 (2009)
Article DOI: 10.1021/jm801026e
BindingDB Entry DOI: 10.7270/Q27H1JG7
Cyclin-dependent kinase 4
(Homo sapiens (Human))
BDBM50267900
(4-[(3-Hydroxy-4-methoxy-benzylamino)-methylene]-6-...)
Show SMILES COc1ccc(CNC=C2C(=O)NC(=O)c3ccc(cc23)-c2ccccc2)cc1O |w:8.7|
Show InChI InChI=1S/C24H20N2O4/c1-30-22-10-7-15(11-21(22)27)13-25-14-20-19-12-17(16-5-3-2-4-6-16)8-9-18(19)23(28)26-24(20)29/h2-12,14,25,27H,13H2,1H3,(H,26,28,29)
NCI pathway
Reactome pathway
n/an/a 10n/an/an/an/an/an/a
Wyeth Research
Curated by ChEMBL
Assay Description
Inhibition of CDK4/Cyclin D1 (unknown origin) assessed as inhibition of retinoblastoma susceptibility gene product phosphorylation
J Med Chem 52: 2289-310 (2009)
Article DOI: 10.1021/jm801026e
BindingDB Entry DOI: 10.7270/Q27H1JG7
Cyclin-dependent kinase 1
(Homo sapiens (Human))
BDBM50267900
(4-[(3-Hydroxy-4-methoxy-benzylamino)-methylene]-6-...)
Show SMILES COc1ccc(CNC=C2C(=O)NC(=O)c3ccc(cc23)-c2ccccc2)cc1O |w:8.7|
Show InChI InChI=1S/C24H20N2O4/c1-30-22-10-7-15(11-21(22)27)13-25-14-20-19-12-17(16-5-3-2-4-6-16)8-9-18(19)23(28)26-24(20)29/h2-12,14,25,27H,13H2,1H3,(H,26,28,29)
Reactome pathway
n/an/a 3.47E+4n/an/an/an/an/an/a
Wyeth Research
Curated by ChEMBL
Assay Description
Inhibition of CDK1/Cyclin B1 (unknown origin) assessed as inhibition of retinoblastoma susceptibility gene product phosphorylation
J Med Chem 52: 2289-310 (2009)
Article DOI: 10.1021/jm801026e
BindingDB Entry DOI: 10.7270/Q27H1JG7