BDBM50267978 CHEMBL4096931
SMILES: CCOC(=O)C1=NNc2cc(nn2C1(O)C(F)(F)C(F)(F)C(F)(F)C(F)(F)F)-c1ccccc1
InChI Key: InChIKey=FKZISGSHVPGMHL-UHFFFAOYSA-N
Data: 1 KI  1 IC50
Activity Spreadsheet -- Enzyme Inhibition Constant Data from BindingDB
Found 2 hits for monomerid = 50267978
Trg + Lig
Ki
nM
ΔG°
kcal/mole
IC50
nM
Kd
nM
EC50/IC50
nM
koff
s-1
kon
M-1s-1
pHTemp
°C
Carboxylesterase
(Sus scrofa)
BDBM50267978
(CHEMBL4096931)
Show SMILES CCOC(=O)C1=NNc2cc(nn2C1(O)C(F)(F)C(F)(F)C(F)(F)C(F)(F)F)-c1ccccc1 |t:5|
Show InChI InChI=1S/C18H13F9N4O3/c1-2-34-13(32)12-14(33,15(19,20)16(21,22)17(23,24)18(25,26)27)31-11(28-29-12)8-10(30-31)9-6-4-3-5-7-9/h3-8,28,33H,2H2,1H3
230n/an/an/an/an/an/an/an/a
Postovsky Institute of Organic Synthesis, Urals Branch of Russian Academy of Sciences, Yekaterinburg 620990, Russia.
Curated by ChEMBL
Assay Description
Competitive inhibition of porcine liver carboxylesterase using varying levels of 4-nitrophenol acetate as substrate preincubated for 10 mins followed...
Bioorg Med Chem 25: 3997-4007 (2017)
Article DOI: 10.1016/j.bmc.2017.05.045
BindingDB Entry DOI: 10.7270/Q2F76G21
Carboxylesterase
(Sus scrofa)
BDBM50267978
(CHEMBL4096931)
Show SMILES CCOC(=O)C1=NNc2cc(nn2C1(O)C(F)(F)C(F)(F)C(F)(F)C(F)(F)F)-c1ccccc1 |t:5|
Show InChI InChI=1S/C18H13F9N4O3/c1-2-34-13(32)12-14(33,15(19,20)16(21,22)17(23,24)18(25,26)27)31-11(28-29-12)8-10(30-31)9-6-4-3-5-7-9/h3-8,28,33H,2H2,1H3
n/an/a 460n/an/an/an/an/an/a
Postovsky Institute of Organic Synthesis, Urals Branch of Russian Academy of Sciences, Yekaterinburg 620990, Russia.
Curated by ChEMBL
Assay Description
Inhibition of porcine liver carboxylesterase using 4-nitrophenol acetate as substrate preincubated for 10 mins followed by substrate addition by spec...
Bioorg Med Chem 25: 3997-4007 (2017)
Article DOI: 10.1016/j.bmc.2017.05.045
BindingDB Entry DOI: 10.7270/Q2F76G21