BDBM50267979 CHEMBL4069738
SMILES: COC(=O)C1=NNc2cc(nn2C1(O)C(F)(F)C(F)(F)C(F)(F)C(F)(F)F)-c1ccccc1
InChI Key: InChIKey=WJOUPXRSFOIBCT-UHFFFAOYSA-N
Data: 1 KI  1 IC50
Activity Spreadsheet -- Enzyme Inhibition Constant Data from BindingDB
Found 2 hits for monomerid = 50267979
Trg + Lig
Ki
nM
ΔG°
kcal/mole
IC50
nM
Kd
nM
EC50/IC50
nM
koff
s-1
kon
M-1s-1
pHTemp
°C
Carboxylesterase
(Sus scrofa)
BDBM50267979
(CHEMBL4069738)
Show SMILES COC(=O)C1=NNc2cc(nn2C1(O)C(F)(F)C(F)(F)C(F)(F)C(F)(F)F)-c1ccccc1 |t:4|
Show InChI InChI=1S/C17H11F9N4O3/c1-33-12(31)11-13(32,14(18,19)15(20,21)16(22,23)17(24,25)26)30-10(27-28-11)7-9(29-30)8-5-3-2-4-6-8/h2-7,27,32H,1H3
700n/an/an/an/an/an/an/an/a
Postovsky Institute of Organic Synthesis, Urals Branch of Russian Academy of Sciences, Yekaterinburg 620990, Russia.
Curated by ChEMBL
Assay Description
Competitive inhibition of porcine liver carboxylesterase using varying levels of 4-nitrophenol acetate as substrate preincubated for 10 mins followed...
Bioorg Med Chem 25: 3997-4007 (2017)
Article DOI: 10.1016/j.bmc.2017.05.045
BindingDB Entry DOI: 10.7270/Q2F76G21
Carboxylesterase
(Sus scrofa)
BDBM50267979
(CHEMBL4069738)
Show SMILES COC(=O)C1=NNc2cc(nn2C1(O)C(F)(F)C(F)(F)C(F)(F)C(F)(F)F)-c1ccccc1 |t:4|
Show InChI InChI=1S/C17H11F9N4O3/c1-33-12(31)11-13(32,14(18,19)15(20,21)16(22,23)17(24,25)26)30-10(27-28-11)7-9(29-30)8-5-3-2-4-6-8/h2-7,27,32H,1H3
n/an/a 960n/an/an/an/an/an/a
Postovsky Institute of Organic Synthesis, Urals Branch of Russian Academy of Sciences, Yekaterinburg 620990, Russia.
Curated by ChEMBL
Assay Description
Inhibition of porcine liver carboxylesterase using 4-nitrophenol acetate as substrate preincubated for 10 mins followed by substrate addition by spec...
Bioorg Med Chem 25: 3997-4007 (2017)
Article DOI: 10.1016/j.bmc.2017.05.045
BindingDB Entry DOI: 10.7270/Q2F76G21