BDBM50268030 (+/-)-1-((1-Methyl-2-[4-(methyloxy)phenyl]ethyl)amino)-3-(phenyloxy)-2-propanol::CHEMBL482876
SMILES: COc1ccc(CC(C)NCC(O)COc2ccccc2)cc1
InChI Key: InChIKey=XNWYZGGTEDTUGE-UHFFFAOYSA-N
Data: 1 IC50
Activity Spreadsheet -- Enzyme Inhibition Constant Data from BindingDB
Found 1 hit for monomerid = 50268030
Trg + Lig
Ki
nM
ΔG°
kcal/mole
IC50
nM
Kd
nM
EC50/IC50
nM
koff
s-1
kon
M-1s-1
pHTemp
°C
Calcium-sensing receptor (CaSR)
(Homo sapiens (Human))
BDBM50268030
((+/-)-1-((1-Methyl-2-[4-(methyloxy)phenyl]ethyl)am...)
Show SMILES COc1ccc(CC(C)NCC(O)COc2ccccc2)cc1
Show InChI InChI=1S/C19H25NO3/c1-15(12-16-8-10-18(22-2)11-9-16)20-13-17(21)14-23-19-6-4-3-5-7-19/h3-11,15,17,20-21H,12-14H2,1-2H3
n/an/a>1.00E+4n/an/an/an/an/an/a
GlaxoSmithKline
Curated by ChEMBL
Assay Description
Binding affinity to human parathyroid calcium receptor 1 expressed in HEK293 4.0-7 cells by radioligand binding assay
J Med Chem 52: 3982-93 (2009)
Article DOI: 10.1021/jm900364m
BindingDB Entry DOI: 10.7270/Q2M61K5X