BDBM50268050 (+/-)-1-((1-Methyl-1-[4-(methyloxy)phenyl]ethyl)amino)-3-(phenyloxy)-2-propanol::CHEMBL483079
SMILES: COc1ccc(cc1)C(C)(C)NCC(O)COc1ccccc1
InChI Key: InChIKey=JGCZHVWQVJRDGT-UHFFFAOYSA-N
Data: 1 IC50
Activity Spreadsheet -- Enzyme Inhibition Constant Data from BindingDB
Found 1 hit for monomerid = 50268050
Trg + Lig
Ki
nM
ΔG°
kcal/mole
IC50
nM
Kd
nM
EC50/IC50
nM
koff
s-1
kon
M-1s-1
pHTemp
°C
Calcium-sensing receptor (CaSR)
(Homo sapiens (Human))
BDBM50268050
((+/-)-1-((1-Methyl-1-[4-(methyloxy)phenyl]ethyl)am...)
Show SMILES COc1ccc(cc1)C(C)(C)NCC(O)COc1ccccc1
Show InChI InChI=1S/C19H25NO3/c1-19(2,15-9-11-17(22-3)12-10-15)20-13-16(21)14-23-18-7-5-4-6-8-18/h4-12,16,20-21H,13-14H2,1-3H3
n/an/a>1.00E+4n/an/an/an/an/an/a
GlaxoSmithKline
Curated by ChEMBL
Assay Description
Binding affinity to human parathyroid calcium receptor 1 expressed in HEK293 4.0-7 cells by radioligand binding assay
J Med Chem 52: 3982-93 (2009)
Article DOI: 10.1021/jm900364m
BindingDB Entry DOI: 10.7270/Q2M61K5X