BDBM50268320 (+/-)-6-fluoro-N-((trans)-2-phenylcyclopropyl)spiro[chroman-2,4'-piperidine]-1'-carboxamide::CHEMBL483876
SMILES: Fc1ccc2OC3(CCN(CC3)C(=O)N[C@H]3C[C@@H]3c3ccccc3)CCc2c1
InChI Key: InChIKey=IUTAFCQVIUFADT-UXHICEINSA-N
Data: 8 IC50
Activity Spreadsheet -- Enzyme Inhibition Constant Data from BindingDB
Found 8 hits for monomerid = 50268320
Trg + Lig
Ki
nM
ΔG°
kcal/mole
IC50
nM
Kd
nM
EC50/IC50
nM
koff
s-1
kon
M-1s-1
pHTemp
°C
EBifunctional epoxide hydrolase 2
(Homo sapiens (Human))
BDBM50268320
((+/-)-6-fluoro-N-((trans)-2-phenylcyclopropyl)spir...)
Show SMILES Fc1ccc2OC3(CCN(CC3)C(=O)N[C@H]3C[C@@H]3c3ccccc3)CCc2c1 |r|
Show InChI InChI=1S/C23H25FN2O2/c24-18-6-7-21-17(14-18)8-9-23(28-21)10-12-26(13-11-23)22(27)25-20-15-19(20)16-4-2-1-3-5-16/h1-7,14,19-20H,8-13,15H2,(H,25,27)/t19-,20+/m1/s1
n/an/a 3n/an/an/an/an/an/a
Merck Research Laboratories
Curated by ChEMBL
Assay Description
Inhibition of human soluble epoxide hydrolase
Bioorg Med Chem Lett 19: 3398-404 (2009)
Article DOI: 10.1016/j.bmcl.2009.05.036
BindingDB Entry DOI: 10.7270/Q20C4VP7
Cytochrome P450 2C9
(Homo sapiens (Human))
BDBM50268320
((+/-)-6-fluoro-N-((trans)-2-phenylcyclopropyl)spir...)
Show SMILES Fc1ccc2OC3(CCN(CC3)C(=O)N[C@H]3C[C@@H]3c3ccccc3)CCc2c1 |r|
Show InChI InChI=1S/C23H25FN2O2/c24-18-6-7-21-17(14-18)8-9-23(28-21)10-12-26(13-11-23)22(27)25-20-15-19(20)16-4-2-1-3-5-16/h1-7,14,19-20H,8-13,15H2,(H,25,27)/t19-,20+/m1/s1
Reactome pathway
n/an/a<1.00E+4n/an/an/an/an/an/a
Merck Research Laboratories
Curated by ChEMBL
Assay Description
Inhibition of CYP2C9
Bioorg Med Chem Lett 19: 3398-404 (2009)
Article DOI: 10.1016/j.bmcl.2009.05.036
BindingDB Entry DOI: 10.7270/Q20C4VP7
Epoxide hydrolase 1
(Homo sapiens (Human))
BDBM50268320
((+/-)-6-fluoro-N-((trans)-2-phenylcyclopropyl)spir...)
Show SMILES Fc1ccc2OC3(CCN(CC3)C(=O)N[C@H]3C[C@@H]3c3ccccc3)CCc2c1 |r|
Show InChI InChI=1S/C23H25FN2O2/c24-18-6-7-21-17(14-18)8-9-23(28-21)10-12-26(13-11-23)22(27)25-20-15-19(20)16-4-2-1-3-5-16/h1-7,14,19-20H,8-13,15H2,(H,25,27)/t19-,20+/m1/s1
n/an/a>1.00E+5n/an/an/an/an/an/a
Merck Research Laboratories
Curated by ChEMBL
Assay Description
Inhibition of human microsomal epoxide hydrolase
Bioorg Med Chem Lett 19: 3398-404 (2009)
Article DOI: 10.1016/j.bmcl.2009.05.036
BindingDB Entry DOI: 10.7270/Q20C4VP7
EBifunctional epoxide hydrolase 2
(Homo sapiens (Human))
BDBM50268320
((+/-)-6-fluoro-N-((trans)-2-phenylcyclopropyl)spir...)
Show SMILES Fc1ccc2OC3(CCN(CC3)C(=O)N[C@H]3C[C@@H]3c3ccccc3)CCc2c1 |r|
Show InChI InChI=1S/C23H25FN2O2/c24-18-6-7-21-17(14-18)8-9-23(28-21)10-12-26(13-11-23)22(27)25-20-15-19(20)16-4-2-1-3-5-16/h1-7,14,19-20H,8-13,15H2,(H,25,27)/t19-,20+/m1/s1
n/an/a<1n/an/an/an/an/an/a
Merck Research Laboratories
Curated by ChEMBL
Assay Description
Inhibition of human soluble epoxide hydrolase
Bioorg Med Chem Lett 19: 3398-404 (2009)
Article DOI: 10.1016/j.bmcl.2009.05.036
BindingDB Entry DOI: 10.7270/Q20C4VP7
Cytochrome P450 2D6
(Homo sapiens (Human))
BDBM50268320
((+/-)-6-fluoro-N-((trans)-2-phenylcyclopropyl)spir...)
Show SMILES Fc1ccc2OC3(CCN(CC3)C(=O)N[C@H]3C[C@@H]3c3ccccc3)CCc2c1 |r|
Show InChI InChI=1S/C23H25FN2O2/c24-18-6-7-21-17(14-18)8-9-23(28-21)10-12-26(13-11-23)22(27)25-20-15-19(20)16-4-2-1-3-5-16/h1-7,14,19-20H,8-13,15H2,(H,25,27)/t19-,20+/m1/s1
n/an/a>1.00E+4n/an/an/an/an/an/a
Merck Research Laboratories
Curated by ChEMBL
Assay Description
Inhibition of CYP2D6
Bioorg Med Chem Lett 19: 3398-404 (2009)
Article DOI: 10.1016/j.bmcl.2009.05.036
BindingDB Entry DOI: 10.7270/Q20C4VP7
Cytochrome P450 3A4
(Homo sapiens (Human))
BDBM50268320
((+/-)-6-fluoro-N-((trans)-2-phenylcyclopropyl)spir...)
Show SMILES Fc1ccc2OC3(CCN(CC3)C(=O)N[C@H]3C[C@@H]3c3ccccc3)CCc2c1 |r|
Show InChI InChI=1S/C23H25FN2O2/c24-18-6-7-21-17(14-18)8-9-23(28-21)10-12-26(13-11-23)22(27)25-20-15-19(20)16-4-2-1-3-5-16/h1-7,14,19-20H,8-13,15H2,(H,25,27)/t19-,20+/m1/s1
Reactome pathway
n/an/a>1.00E+4n/an/an/an/an/an/a
Merck Research Laboratories
Curated by ChEMBL
Assay Description
Inhibition of CYP3A4
Bioorg Med Chem Lett 19: 3398-404 (2009)
Article DOI: 10.1016/j.bmcl.2009.05.036
BindingDB Entry DOI: 10.7270/Q20C4VP7
Sodium channel protein type 5 subunit alpha
(Homo sapiens (Human))
BDBM50268320
((+/-)-6-fluoro-N-((trans)-2-phenylcyclopropyl)spir...)
Show SMILES Fc1ccc2OC3(CCN(CC3)C(=O)N[C@H]3C[C@@H]3c3ccccc3)CCc2c1 |r|
Show InChI InChI=1S/C23H25FN2O2/c24-18-6-7-21-17(14-18)8-9-23(28-21)10-12-26(13-11-23)22(27)25-20-15-19(20)16-4-2-1-3-5-16/h1-7,14,19-20H,8-13,15H2,(H,25,27)/t19-,20+/m1/s1
n/an/a>1.00E+4n/an/an/an/an/an/a
Merck Research Laboratories
Curated by ChEMBL
Assay Description
Inhibition of Voltage-gated sodium channel subunit alpha Nav1.5
Bioorg Med Chem Lett 19: 3398-404 (2009)
Article DOI: 10.1016/j.bmcl.2009.05.036
BindingDB Entry DOI: 10.7270/Q20C4VP7
Epoxide hydrolase 2
(Rattus norvegicus)
BDBM50268320
((+/-)-6-fluoro-N-((trans)-2-phenylcyclopropyl)spir...)
Show SMILES Fc1ccc2OC3(CCN(CC3)C(=O)N[C@H]3C[C@@H]3c3ccccc3)CCc2c1 |r|
Show InChI InChI=1S/C23H25FN2O2/c24-18-6-7-21-17(14-18)8-9-23(28-21)10-12-26(13-11-23)22(27)25-20-15-19(20)16-4-2-1-3-5-16/h1-7,14,19-20H,8-13,15H2,(H,25,27)/t19-,20+/m1/s1
n/an/a 18n/an/an/an/an/an/a
Merck Research Laboratories
Curated by ChEMBL
Assay Description
Inhibition of rat soluble epoxide hydrolase
Bioorg Med Chem Lett 19: 3398-404 (2009)
Article DOI: 10.1016/j.bmcl.2009.05.036
BindingDB Entry DOI: 10.7270/Q20C4VP7