null
SMILES: Cc1cc(C[C@@H](OC(=O)N2CCC(CC2)n2cc([nH]c2=O)-c2ccccc2)C(=O)N2CCC(CC2)N2CCCCC2)cc2cn[nH]c12
InChI Key: InChIKey=VAFZBFGQABHBKX-JGCGQSQUSA-N
Activity Spreadsheet -- Enzyme Inhibition Constant Data from BindingDB
Found 1 hit for monomerid = 50268477
Trg + Lig
Ki
nM
ΔG°
kcal/mole
IC50
nM
Kd
nM
EC50/IC50
nM
koff
s-1
kon
M-1s-1
pHTemp
°C
Calcitonin gene-related peptide type 1 receptor
(Homo sapiens (Human))
BDBM50268477
((R)-1-(1,4'-bipiperidin-1'-yl)-3-(7-methyl-1H-inda...)
Show SMILES Cc1cc(C[C@@H](OC(=O)N2CCC(CC2)n2cc([nH]c2=O)-c2ccccc2)C(=O)N2CCC(CC2)N2CCCCC2)cc2cn[nH]c12 |r|
Show InChI InChI=1S/C36H45N7O4/c1-25-20-26(21-28-23-37-39-33(25)28)22-32(34(44)41-16-10-29(11-17-41)40-14-6-3-7-15-40)47-36(46)42-18-12-30(13-19-42)43-24-31(38-35(43)45)27-8-4-2-5-9-27/h2,4-5,8-9,20-21,23-24,29-30,32H,3,6-7,10-19,22H2,1H3,(H,37,39)(H,38,45)/t32-/m1/s1
n/an/a 0.0680n/an/an/an/an/an/a
Bristol-Myers Squibb Research and Development
Curated by ChEMBL
Assay Description
Antagonist activity at human cloned CGRP receptor expressed in mouse E10 cells assessed as inhibition of CGRP-induced cAMP production
Bioorg Med Chem Lett 19: 3555-8 (2009)
Article DOI: 10.1016/j.bmcl.2009.04.150
BindingDB Entry DOI: 10.7270/Q2WM1DBQ