BDBM50268480 (2R)-3-(7-methyl-1H-indazol-5-yl)-1-(9-methyl-3,9-diazaspiro[5.5]undecan-3-yl)-1-oxopropan-2-yl 4-(2-oxo-1,2-dihydroquinolin-3-yl)piperidine-1-carboxylate::CHEMBL501603
SMILES: CN1CCC2(CC1)CCN(CC2)C(=O)[C@@H](Cc1cc(C)c2[nH]ncc2c1)OC(=O)N1CCC(CC1)c1cc2ccccc2[nH]c1=O
InChI Key: InChIKey=HRZHXNOUBFMSNO-WJOKGBTCSA-N
Data: 1 IC50
Activity Spreadsheet -- Enzyme Inhibition Constant Data from BindingDB
Found 1 hit for monomerid = 50268480
Trg + Lig
Ki
nM
ΔG°
kcal/mole
IC50
nM
Kd
nM
EC50/IC50
nM
koff
s-1
kon
M-1s-1
pHTemp
°C
Calcitonin gene-related peptide type 1 receptor
(Homo sapiens (Human))
BDBM50268480
((2R)-3-(7-methyl-1H-indazol-5-yl)-1-(9-methyl-3,9-...)
Show SMILES CN1CCC2(CC1)CCN(CC2)C(=O)[C@@H](Cc1cc(C)c2[nH]ncc2c1)OC(=O)N1CCC(CC1)c1cc2ccccc2[nH]c1=O |r|
Show InChI InChI=1S/C36H44N6O4/c1-24-19-25(20-28-23-37-39-32(24)28)21-31(34(44)41-17-11-36(12-18-41)9-15-40(2)16-10-36)46-35(45)42-13-7-26(8-14-42)29-22-27-5-3-4-6-30(27)38-33(29)43/h3-6,19-20,22-23,26,31H,7-18,21H2,1-2H3,(H,37,39)(H,38,43)/t31-/m1/s1
Reactome pathway
n/an/a 0.0440n/an/an/an/an/an/a
Bristol-Myers Squibb Research and Development
Curated by ChEMBL
Assay Description
Antagonist activity at human cloned CGRP receptor expressed in mouse E10 cells assessed as inhibition of CGRP-induced cAMP production
Bioorg Med Chem Lett 19: 3555-8 (2009)
Article DOI: 10.1016/j.bmcl.2009.04.150
BindingDB Entry DOI: 10.7270/Q2WM1DBQ