BDBM50268869 CHEMBL4075387
SMILES: COc1cc2nc(nc(NC3CCN(C)CC3)c2cc1OC)N(C)CCN(C)C
InChI Key: InChIKey=LHNQVGYVOOWUCA-UHFFFAOYSA-N
Data: 2 IC50
Activity Spreadsheet -- Enzyme Inhibition Constant Data from BindingDB
Found 2 hits for monomerid = 50268869
Trg + Lig
Ki
nM
ΔG°
kcal/mole
IC50
nM
Kd
nM
EC50/IC50
nM
koff
s-1
kon
M-1s-1
pHTemp
°C
Protein G9a (G9a)
(Homo sapiens (Human))
BDBM50268869
(CHEMBL4075387)
Show SMILES COc1cc2nc(nc(NC3CCN(C)CC3)c2cc1OC)N(C)CCN(C)C
Show InChI InChI=1S/C21H34N6O2/c1-25(2)11-12-27(4)21-23-17-14-19(29-6)18(28-5)13-16(17)20(24-21)22-15-7-9-26(3)10-8-15/h13-15H,7-12H2,1-6H3,(H,22,23,24)
n/an/a 151n/an/an/an/an/an/a
Icahn School of Medicine at Mount Sinai
Curated by ChEMBL
Assay Description
Inhibition of human G9a catalytic domain (913 to 1193 residues) expressed in Escherichia coli BL21 (DE3) using biotinylated H3 (1 to 25 residues) as ...
Bioorg Med Chem 25: 4414-4423 (2017)
Article DOI: 10.1016/j.bmc.2017.06.021
BindingDB Entry DOI: 10.7270/Q2X350ZG
Histone-lysine N-methyltransferase EHMT1
(Homo sapiens (Human))
BDBM50268869
(CHEMBL4075387)
Show SMILES COc1cc2nc(nc(NC3CCN(C)CC3)c2cc1OC)N(C)CCN(C)C
Show InChI InChI=1S/C21H34N6O2/c1-25(2)11-12-27(4)21-23-17-14-19(29-6)18(28-5)13-16(17)20(24-21)22-15-7-9-26(3)10-8-15/h13-15H,7-12H2,1-6H3,(H,22,23,24)
Reactome pathway
n/an/a 24n/an/an/an/an/an/a
Icahn School of Medicine at Mount Sinai
Curated by ChEMBL
Assay Description
Inhibition of human GLP catalytic domain (951 to 1235 residues) expressed in Escherichia coli BL21 (DE3) using biotinylated H3 (1 to 25 residues) as ...
Bioorg Med Chem 25: 4414-4423 (2017)
Article DOI: 10.1016/j.bmc.2017.06.021
BindingDB Entry DOI: 10.7270/Q2X350ZG