BDBM50268902 CHEMBL4083783
SMILES: COc1cc2nc(NC3CCCCC3)nc(NC3CCN(C)CC3)c2cc1OC
InChI Key: InChIKey=FNDUCTFWOZQGTB-UHFFFAOYSA-N
Data: 2 IC50
Activity Spreadsheet -- Enzyme Inhibition Constant Data from BindingDB
Found 2 hits for monomerid = 50268902
Trg + Lig
Ki
nM
ΔG°
kcal/mole
IC50
nM
Kd
nM
EC50/IC50
nM
koff
s-1
kon
M-1s-1
pHTemp
°C
Histone-lysine N-methyltransferase EHMT1
(Homo sapiens (Human))
BDBM50268902
(CHEMBL4083783)
Show SMILES COc1cc2nc(NC3CCCCC3)nc(NC3CCN(C)CC3)c2cc1OC
Show InChI InChI=1S/C22H33N5O2/c1-27-11-9-16(10-12-27)23-21-17-13-19(28-2)20(29-3)14-18(17)25-22(26-21)24-15-7-5-4-6-8-15/h13-16H,4-12H2,1-3H3,(H2,23,24,25,26)
Reactome pathway
n/an/a 77n/an/an/an/an/an/a
Icahn School of Medicine at Mount Sinai
Curated by ChEMBL
Assay Description
Inhibition of human GLP catalytic domain (951 to 1235 residues) expressed in Escherichia coli BL21 (DE3) using biotinylated H3 (1 to 25 residues) as ...
Bioorg Med Chem 25: 4414-4423 (2017)
Article DOI: 10.1016/j.bmc.2017.06.021
BindingDB Entry DOI: 10.7270/Q2X350ZG
Protein G9a (G9a)
(Homo sapiens (Human))
BDBM50268902
(CHEMBL4083783)
Show SMILES COc1cc2nc(NC3CCCCC3)nc(NC3CCN(C)CC3)c2cc1OC
Show InChI InChI=1S/C22H33N5O2/c1-27-11-9-16(10-12-27)23-21-17-13-19(28-2)20(29-3)14-18(17)25-22(26-21)24-15-7-5-4-6-8-15/h13-16H,4-12H2,1-3H3,(H2,23,24,25,26)
n/an/a 956n/an/an/an/an/an/a
Icahn School of Medicine at Mount Sinai
Curated by ChEMBL
Assay Description
Inhibition of human G9a catalytic domain (913 to 1193 residues) expressed in Escherichia coli BL21 (DE3) using biotinylated H3 (1 to 25 residues) as ...
Bioorg Med Chem 25: 4414-4423 (2017)
Article DOI: 10.1016/j.bmc.2017.06.021
BindingDB Entry DOI: 10.7270/Q2X350ZG