BDBM50269112 1-{6-[4-(4-Benzylphthalazin-1-yl)piperazin-1-yl]pyridin-3-yl}1-methylethylamine::CHEMBL497266
SMILES: CC(C)(N)c1ccc(nc1)N1CCN(CC1)c1nnc(Cc2ccccc2)c2ccccc12
InChI Key: InChIKey=WLZLUGVHAHGDCQ-UHFFFAOYSA-N
Data: 4 IC50
Activity Spreadsheet -- Enzyme Inhibition Constant Data from BindingDB
Found 4 hits for monomerid = 50269112
Trg + Lig
Ki
nM
ΔG°
kcal/mole
IC50
nM
Kd
nM
EC50/IC50
nM
koff
s-1
kon
M-1s-1
pHTemp
°C
Smoothened homolog
(Mus musculus)
BDBM50269112
(1-{6-[4-(4-Benzylphthalazin-1-yl)piperazin-1-yl]py...)
Show SMILES CC(C)(N)c1ccc(nc1)N1CCN(CC1)c1nnc(Cc2ccccc2)c2ccccc12
Show InChI InChI=1S/C27H30N6/c1-27(2,28)21-12-13-25(29-19-21)32-14-16-33(17-15-32)26-23-11-7-6-10-22(23)24(30-31-26)18-20-8-4-3-5-9-20/h3-13,19H,14-18,28H2,1-2H3
n/an/a 42n/an/an/an/an/an/a
Novartis Institutes for Biomedical Research
Curated by ChEMBL
Assay Description
Inhibition of Smoothened receptor in mouse TM3 cells transfected with pTA-8xGli-Luc reporter gene assessed as inhibition of 25 nM 3-chloro-4,7-difluo...
J Med Chem 52: 3954-68 (2009)
Article DOI: 10.1021/jm900309j
BindingDB Entry DOI: 10.7270/Q2CN73T7
G-protein- coupled-like receptor Smoothened (Smo)
(Homo sapiens (Human))
BDBM50269112
(1-{6-[4-(4-Benzylphthalazin-1-yl)piperazin-1-yl]py...)
Show SMILES CC(C)(N)c1ccc(nc1)N1CCN(CC1)c1nnc(Cc2ccccc2)c2ccccc12
Show InChI InChI=1S/C27H30N6/c1-27(2,28)21-12-13-25(29-19-21)32-14-16-33(17-15-32)26-23-11-7-6-10-22(23)24(30-31-26)18-20-8-4-3-5-9-20/h3-13,19H,14-18,28H2,1-2H3
n/an/a 15n/an/an/an/an/an/a
Novartis Institutes for Biomedical Research
Curated by ChEMBL
Assay Description
Displacement of [3H]3-chloro-4,7-difluoro-N-(4-methoxy-3-(pyridin-4-yl)benzyl)-N-(4-(methylamino)cyclohexyl)benzo[b]thiophene-2-carboxamide from huma...
J Med Chem 52: 3954-68 (2009)
Article DOI: 10.1021/jm900309j
BindingDB Entry DOI: 10.7270/Q2CN73T7
Smoothened homolog
(Mus musculus)
BDBM50269112
(1-{6-[4-(4-Benzylphthalazin-1-yl)piperazin-1-yl]py...)
Show SMILES CC(C)(N)c1ccc(nc1)N1CCN(CC1)c1nnc(Cc2ccccc2)c2ccccc12
Show InChI InChI=1S/C27H30N6/c1-27(2,28)21-12-13-25(29-19-21)32-14-16-33(17-15-32)26-23-11-7-6-10-22(23)24(30-31-26)18-20-8-4-3-5-9-20/h3-13,19H,14-18,28H2,1-2H3
n/an/a 1.30n/an/an/an/an/an/a
Novartis Institutes for Biomedical Research
Curated by ChEMBL
Assay Description
Inhibition of Smoothened receptor in mouse TM3 cells transfected with pTA-8xGli-Luc reporter gene assessed as inhibition of 1 nM 3-chloro-4,7-difluor...
J Med Chem 52: 3954-68 (2009)
Article DOI: 10.1021/jm900309j
BindingDB Entry DOI: 10.7270/Q2CN73T7
Smoothened homolog
(Mus musculus)
BDBM50269112
(1-{6-[4-(4-Benzylphthalazin-1-yl)piperazin-1-yl]py...)
Show SMILES CC(C)(N)c1ccc(nc1)N1CCN(CC1)c1nnc(Cc2ccccc2)c2ccccc12
Show InChI InChI=1S/C27H30N6/c1-27(2,28)21-12-13-25(29-19-21)32-14-16-33(17-15-32)26-23-11-7-6-10-22(23)24(30-31-26)18-20-8-4-3-5-9-20/h3-13,19H,14-18,28H2,1-2H3
n/an/a 6n/an/an/an/an/an/a
Novartis Institutes for Biomedical Research
Curated by ChEMBL
Assay Description
Displacement of [3H]3-chloro-4,7-difluoro-N-(4-methoxy-3-(pyridin-4-yl)benzyl)-N-(4-(methylamino)cyclohexyl)benzo[b]thiophene-2-carboxamide from mous...
J Med Chem 52: 3954-68 (2009)
Article DOI: 10.1021/jm900309j
BindingDB Entry DOI: 10.7270/Q2CN73T7