null
SMILES: O[C@@H]1[C@@H](COC(=O)\C=C\c2ccc(O)c(O)c2)O[C@@H](OCCc2ccc(O)c(O)c2)[C@H](O)[C@H]1O
InChI Key: InChIKey=LFKQVVDFNHDYNK-FOXCETOMSA-N
Activity Spreadsheet -- Enzyme Inhibition Constant Data from BindingDB
Found 2 hits for monomerid = 50269516
Trg + Lig
Ki
nM
ΔG°
kcal/mole
IC50
nM
Kd
nM
EC50/IC50
nM
koff
s-1
kon
M-1s-1
pHTemp
°C
Aromatase
(Homo sapiens (Human))
BDBM50269516
(CHEMBL518414 | Calceolarioside B)
Show SMILES O[C@@H]1[C@@H](COC(=O)\C=C\c2ccc(O)c(O)c2)O[C@@H](OCCc2ccc(O)c(O)c2)[C@H](O)[C@H]1O |r|
Show InChI InChI=1S/C23H26O11/c24-14-4-1-12(9-16(14)26)3-6-19(28)33-11-18-20(29)21(30)22(31)23(34-18)32-8-7-13-2-5-15(25)17(27)10-13/h1-6,9-10,18,20-27,29-31H,7-8,11H2/b6-3+/t18-,20-,21+,22-,23-/m1/s1
Reactome pathway
n/an/a 3.53E+4n/an/an/an/an/an/a
Yunnan Normal University
Curated by ChEMBL
Assay Description
Inhibition of aromatase preincubated with 2.6 mM NADP+ for 10 mins before substrate addition measured after 30 mins by fluorescence assay
J Nat Prod 74: 129-36 (2011)
Article DOI: 10.1021/np100373f
BindingDB Entry DOI: 10.7270/Q20865MS
Protein kinase C alpha type
(Homo sapiens (Human))
BDBM50269516
(CHEMBL518414 | Calceolarioside B)
Show SMILES O[C@@H]1[C@@H](COC(=O)\C=C\c2ccc(O)c(O)c2)O[C@@H](OCCc2ccc(O)c(O)c2)[C@H](O)[C@H]1O |r|
Show InChI InChI=1S/C23H26O11/c24-14-4-1-12(9-16(14)26)3-6-19(28)33-11-18-20(29)21(30)22(31)23(34-18)32-8-7-13-2-5-15(25)17(27)10-13/h1-6,9-10,18,20-27,29-31H,7-8,11H2/b6-3+/t18-,20-,21+,22-,23-/m1/s1
NCI pathway
Reactome pathway
n/an/a 4.60E+3n/an/an/an/an/an/a
Virginia Polytechnic Institute and State University
Curated by ChEMBL
Assay Description
Inhibition of human recombinant PKCalpha
J Nat Prod 61: 1410-2 (1999)
Article DOI: 10.1021/np980147s
BindingDB Entry DOI: 10.7270/Q2348M80