BDBM50269843 Bolinaquinone::CHEMBL477692
SMILES: COC1=CC(=O)C(=O)C(C[C@@]2(C)CC[C@@]3(C)[C@@H](CCC=C3C)[C@H]2C)C1=O
InChI Key: InChIKey=ROYDBKIDSHZSNQ-UVEFZZHKSA-N
Data: 3 IC50
Activity Spreadsheet -- Enzyme Inhibition Constant Data from BindingDB
Found 3 hits for monomerid = 50269843
Trg + Lig
Ki
nM
ΔG°
kcal/mole
IC50
nM
Kd
nM
EC50/IC50
nM
koff
s-1
kon
M-1s-1
pHTemp
°C
Phospholipase A2, major isoenzyme
(Sus scrofa (pig))
BDBM50269843
(Bolinaquinone | CHEMBL477692)
Show SMILES COC1=CC(=O)C(=O)C(C[C@@]2(C)CC[C@@]3(C)[C@@H](CCC=C3C)[C@H]2C)C1=O |r,c:19,t:2|
Show InChI InChI=1S/C22H30O4/c1-13-7-6-8-16-14(2)21(3,9-10-22(13,16)4)12-15-19(24)17(23)11-18(26-5)20(15)25/h7,11,14-16H,6,8-10,12H2,1-5H3/t14-,15?,16+,21-,22-/m1/s1
n/an/a 400n/an/an/an/an/an/a
Università degli Studi di Napoli Federico II
Curated by ChEMBL
Assay Description
Inhibition of pig pancreatic group 1 secretory phospholipase A2 by liquid scintillation counting
J Nat Prod 64: 612-5 (2001)
BindingDB Entry DOI: 10.7270/Q28915MQ
Phospholipase A2 (Bee)
(Apis mellifera)
BDBM50269843
(Bolinaquinone | CHEMBL477692)
Show SMILES COC1=CC(=O)C(=O)C(C[C@@]2(C)CC[C@@]3(C)[C@@H](CCC=C3C)[C@H]2C)C1=O |r,c:19,t:2|
Show InChI InChI=1S/C22H30O4/c1-13-7-6-8-16-14(2)21(3,9-10-22(13,16)4)12-15-19(24)17(23)11-18(26-5)20(15)25/h7,11,14-16H,6,8-10,12H2,1-5H3/t14-,15?,16+,21-,22-/m1/s1
n/an/a 100n/an/an/an/an/an/a
Università degli Studi di Napoli Federico II
Curated by ChEMBL
Assay Description
Inhibition of bee venom group 3 secretory phospholipase A2 by liquid scintillation counting
J Nat Prod 64: 612-5 (2001)
BindingDB Entry DOI: 10.7270/Q28915MQ
Phospholipase A2, membrane associated
(Homo sapiens (Human))
BDBM50269843
(Bolinaquinone | CHEMBL477692)
Show SMILES COC1=CC(=O)C(=O)C(C[C@@]2(C)CC[C@@]3(C)[C@@H](CCC=C3C)[C@H]2C)C1=O |r,c:19,t:2|
Show InChI InChI=1S/C22H30O4/c1-13-7-6-8-16-14(2)21(3,9-10-22(13,16)4)12-15-19(24)17(23)11-18(26-5)20(15)25/h7,11,14-16H,6,8-10,12H2,1-5H3/t14-,15?,16+,21-,22-/m1/s1
NCI pathway
Reactome pathway
n/an/a 200n/an/an/an/an/an/a
Università degli Studi di Napoli Federico II
Curated by ChEMBL
Assay Description
Inhibition of human synovial recombinant group 2 secretory phospholipase A2 by liquid scintillation counting
J Nat Prod 64: 612-5 (2001)
BindingDB Entry DOI: 10.7270/Q28915MQ