BDBM50270282 (E/Z)-3-benzylidenequinuclidine::CHEMBL478358
SMILES: C1CN2CCC1\C(C2)=C\c1ccccc1
InChI Key: InChIKey=ULHUYFVJQMXTQV-GXDHUFHOSA-N
Data: 2 KI  2 IC50  2 EC50
Activity Spreadsheet -- Enzyme Inhibition Constant Data from BindingDB
Found 6 hits for monomerid = 50270282
Trg + Lig
Ki
nM
ΔG°
kcal/mole
IC50
nM
Kd
nM
EC50/IC50
nM
koff
s-1
kon
M-1s-1
pHTemp
°C
Neuronal acetylcholine receptor Alpha-4/Beta-2
(Homo sapiens (Human))
BDBM50270282
((E/Z)-3-benzylidenequinuclidine | CHEMBL478358)
Show SMILES C1CN2CCC1\C(C2)=C\c1ccccc1 |(-9.93,3.02,;-9.93,1.47,;-8.6,.7,;-7.85,2.03,;-9.33,2.44,;-8.6,3.79,;-7.26,3.02,;-7.26,1.47,;-5.93,3.79,;-4.59,3.01,;-4.6,1.48,;-3.27,.71,;-1.94,1.47,;-1.94,3.02,;-3.27,3.78,)|
Show InChI InChI=1S/C14H17N/c1-2-4-12(5-3-1)10-14-11-15-8-6-13(14)7-9-15/h1-5,10,13H,6-9,11H2/b14-10+
NCI pathway
Reactome pathway
1.60E+3n/an/an/an/an/an/an/an/a
Targacept, Inc
Curated by ChEMBL
Assay Description
Displacement of [3H]nicotine from human alpha4beta2 nAChR expressed in human SH-EP1 cell membranes after 2 hrs by liquid scintillation counting analy...
Bioorg Med Chem Lett 23: 4842-7 (2013)
Article DOI: 10.1016/j.bmcl.2013.06.094
BindingDB Entry DOI: 10.7270/Q2VT1THP
Neuronal acetylcholine receptor; alpha3/beta4
(Homo sapiens (Human))
BDBM50270282
((E/Z)-3-benzylidenequinuclidine | CHEMBL478358)
Show SMILES C1CN2CCC1\C(C2)=C\c1ccccc1 |(-9.93,3.02,;-9.93,1.47,;-8.6,.7,;-7.85,2.03,;-9.33,2.44,;-8.6,3.79,;-7.26,3.02,;-7.26,1.47,;-5.93,3.79,;-4.59,3.01,;-4.6,1.48,;-3.27,.71,;-1.94,1.47,;-1.94,3.02,;-3.27,3.78,)|
Show InChI InChI=1S/C14H17N/c1-2-4-12(5-3-1)10-14-11-15-8-6-13(14)7-9-15/h1-5,10,13H,6-9,11H2/b14-10+
2.10E+3n/an/an/an/an/an/an/an/a
Targacept, Inc.
Curated by ChEMBL
Assay Description
Displacement of [3H]epibatidine from human alpha3beta4 nAChR expressed in CHO cells after 2 hrs by liquid scintillation counting
Bioorg Med Chem Lett 23: 1450-5 (2013)
Article DOI: 10.1016/j.bmcl.2012.12.054
BindingDB Entry DOI: 10.7270/Q2SQ939P
Neuronal acetylcholine receptor Alpha-4/Beta-2
(Homo sapiens (Human))
BDBM50270282
((E/Z)-3-benzylidenequinuclidine | CHEMBL478358)
Show SMILES C1CN2CCC1\C(C2)=C\c1ccccc1 |(-9.93,3.02,;-9.93,1.47,;-8.6,.7,;-7.85,2.03,;-9.33,2.44,;-8.6,3.79,;-7.26,3.02,;-7.26,1.47,;-5.93,3.79,;-4.59,3.01,;-4.6,1.48,;-3.27,.71,;-1.94,1.47,;-1.94,3.02,;-3.27,3.78,)|
Show InChI InChI=1S/C14H17N/c1-2-4-12(5-3-1)10-14-11-15-8-6-13(14)7-9-15/h1-5,10,13H,6-9,11H2/b14-10+
NCI pathway
Reactome pathway
n/an/an/an/a>1.00E+4n/an/an/an/a
Targacept, Inc
Curated by ChEMBL
Assay Description
Agonist activity at human alpha4beta2 nAChR expressed in human SH-EP1 cells assessed as induction of intracellular Ca2+ influx by FLIPR assay
Bioorg Med Chem Lett 23: 4842-7 (2013)
Article DOI: 10.1016/j.bmcl.2013.06.094
BindingDB Entry DOI: 10.7270/Q2VT1THP
Neuronal acetylcholine receptor; alpha3/beta4
(Homo sapiens (Human))
BDBM50270282
((E/Z)-3-benzylidenequinuclidine | CHEMBL478358)
Show SMILES C1CN2CCC1\C(C2)=C\c1ccccc1 |(-9.93,3.02,;-9.93,1.47,;-8.6,.7,;-7.85,2.03,;-9.33,2.44,;-8.6,3.79,;-7.26,3.02,;-7.26,1.47,;-5.93,3.79,;-4.59,3.01,;-4.6,1.48,;-3.27,.71,;-1.94,1.47,;-1.94,3.02,;-3.27,3.78,)|
Show InChI InChI=1S/C14H17N/c1-2-4-12(5-3-1)10-14-11-15-8-6-13(14)7-9-15/h1-5,10,13H,6-9,11H2/b14-10+
n/an/an/an/a 3.00E+3n/an/an/an/a
Targacept, Inc.
Curated by ChEMBL
Assay Description
Agonist activity at human alpha3beta4 nAChR expressed in CHO cells assessed as calcium influx by calcium-4 based FLIPR analysis
Bioorg Med Chem Lett 23: 1450-5 (2013)
Article DOI: 10.1016/j.bmcl.2012.12.054
BindingDB Entry DOI: 10.7270/Q2SQ939P
Neuronal acetylcholine receptor; alpha3/beta4
(Homo sapiens (Human))
BDBM50270282
((E/Z)-3-benzylidenequinuclidine | CHEMBL478358)
Show SMILES C1CN2CCC1\C(C2)=C\c1ccccc1 |(-9.93,3.02,;-9.93,1.47,;-8.6,.7,;-7.85,2.03,;-9.33,2.44,;-8.6,3.79,;-7.26,3.02,;-7.26,1.47,;-5.93,3.79,;-4.59,3.01,;-4.6,1.48,;-3.27,.71,;-1.94,1.47,;-1.94,3.02,;-3.27,3.78,)|
Show InChI InChI=1S/C14H17N/c1-2-4-12(5-3-1)10-14-11-15-8-6-13(14)7-9-15/h1-5,10,13H,6-9,11H2/b14-10+
n/an/a 6.00E+3n/an/an/an/an/an/a
Targacept, Inc.
Curated by ChEMBL
Assay Description
Inhibition of human alpha3beta4 nAChR expressed in CHO cells assessed as inhibition of calcium influx by calcium-4 based FLIPR analysis
Bioorg Med Chem Lett 23: 1450-5 (2013)
Article DOI: 10.1016/j.bmcl.2012.12.054
BindingDB Entry DOI: 10.7270/Q2SQ939P
Farnesyltransferase, putative
(Leishmania major)
BDBM50270282
((E/Z)-3-benzylidenequinuclidine | CHEMBL478358)
Show SMILES C1CN2CCC1\C(C2)=C\c1ccccc1 |(-9.93,3.02,;-9.93,1.47,;-8.6,.7,;-7.85,2.03,;-9.33,2.44,;-8.6,3.79,;-7.26,3.02,;-7.26,1.47,;-5.93,3.79,;-4.59,3.01,;-4.6,1.48,;-3.27,.71,;-1.94,1.47,;-1.94,3.02,;-3.27,3.78,)|
Show InChI InChI=1S/C14H17N/c1-2-4-12(5-3-1)10-14-11-15-8-6-13(14)7-9-15/h1-5,10,13H,6-9,11H2/b14-10+
n/an/a>1.00E+3n/an/an/an/an/an/a
Cardiff University
Curated by ChEMBL
Assay Description
Inhibition of Leishmania major recombinant squalene synthase expressed in Escherichia coli by liquid scintillation counter
Antimicrob Agents Chemother 51: 4049-61 (2007)
Article DOI: 10.1128/AAC.00205-07
BindingDB Entry DOI: 10.7270/Q2MS3SJZ