BDBM50270343 (2R,3S,4S,5R)-2-(hydroxymethyl)-5-(((S)-1-(naphthalen-2-yl)ethylamino)methyl)-tetrahydrofuran-3,4-diol::CHEMBL477085
SMILES: C[C@H](NC[C@H]1O[C@H](CO)[C@@H](O)[C@@H]1O)c1ccc2ccccc2c1
InChI Key: InChIKey=RFLHZHOTKRVJMA-WUWGZROLSA-N
Data: 1 IC50
Activity Spreadsheet -- Enzyme Inhibition Constant Data from BindingDB
Found 1 hit for monomerid = 50270343
Trg + Lig
Ki
nM
ΔG°
kcal/mole
IC50
nM
Kd
nM
EC50/IC50
nM
koff
s-1
kon
M-1s-1
pHTemp
°C
Pyruvate kinase
(Leishmania mexicana)
BDBM50270343
((2R,3S,4S,5R)-2-(hydroxymethyl)-5-(((S)-1-(naphtha...)
Show SMILES C[C@H](NC[C@H]1O[C@H](CO)[C@@H](O)[C@@H]1O)c1ccc2ccccc2c1 |r|
Show InChI InChI=1S/C18H23NO4/c1-11(13-7-6-12-4-2-3-5-14(12)8-13)19-9-15-17(21)18(22)16(10-20)23-15/h2-8,11,15-22H,9-10H2,1H3/t11-,15+,16+,17+,18+/m0/s1
n/an/a 1.50E+6n/an/an/an/an/an/a
University of Edinburgh
Curated by ChEMBL
Assay Description
Inhibition of Leishmania mexicana pyruvate kinase
Bioorg Med Chem 16: 5050-61 (2008)
Article DOI: 10.1016/j.bmc.2008.03.045
BindingDB Entry DOI: 10.7270/Q21J99JR