BDBM50270460 2,5-Anhydro-1-deoxy-1-(3,4-dichlorobenzylamino)-D-mannitol::CHEMBL518269
SMILES: OC[C@H]1O[C@H](CNCc2ccc(Cl)c(Cl)c2)[C@@H](O)[C@@H]1O
InChI Key: InChIKey=VLSCPWITCNYPCV-FDYHWXHSSA-N
Data: 1 IC50
Activity Spreadsheet -- Enzyme Inhibition Constant Data from BindingDB
Found 1 hit for monomerid = 50270460
Trg + Lig
Ki
nM
ΔG°
kcal/mole
IC50
nM
Kd
nM
EC50/IC50
nM
koff
s-1
kon
M-1s-1
pHTemp
°C
6-phospho-1-fructokinase
(Trypanosoma brucei)
BDBM50270460
(2,5-Anhydro-1-deoxy-1-(3,4-dichlorobenzylamino)-D-...)
Show SMILES OC[C@H]1O[C@H](CNCc2ccc(Cl)c(Cl)c2)[C@@H](O)[C@@H]1O |r|
Show InChI InChI=1S/C13H17Cl2NO4/c14-8-2-1-7(3-9(8)15)4-16-5-10-12(18)13(19)11(6-17)20-10/h1-3,10-13,16-19H,4-6H2/t10-,11-,12-,13-/m1/s1
n/an/a 4.10E+5n/an/an/an/an/an/a
University of Edinburgh
Curated by ChEMBL
Assay Description
Inhibition of Trypanosoma brucei phosphofructokinase
Bioorg Med Chem 16: 5050-61 (2008)
Article DOI: 10.1016/j.bmc.2008.03.045
BindingDB Entry DOI: 10.7270/Q21J99JR