BDBM50271524 2-(4-(4-(H-imidazo[1,2-a]pyridin-3-yl)pyrimidin-2-ylamino)piperidin-1-yl)-N-methylacetamide::2-{4-[(4-imidazo[1,2-a]pyridin-3-ylpyrimidin-2-yl)amino]piperidin-1-yl}-N-methylacetamide::CHEMBL485323
SMILES: CNC(=O)CN1CCC(CC1)Nc1nccc(n1)-c1cnc2ccccn12
InChI Key: InChIKey=AJLILYAPRHIFAS-UHFFFAOYSA-N
Data: 2 IC50
PDB links: 1 PDB ID matches this monomer.
Activity Spreadsheet -- Enzyme Inhibition Constant Data from BindingDB
Found 2 hits for monomerid = 50271524
Trg + Lig
Ki
nM
ΔG°
kcal/mole
IC50
nM
Kd
nM
EC50/IC50
nM
koff
s-1
kon
M-1s-1
pHTemp
°C
Mitogen-activated protein kinase 10
(Homo sapiens (Human))
BDBM50271524
(2-(4-(4-(H-imidazo[1,2-a]pyridin-3-yl)pyrimidin-2-...)
Show SMILES CNC(=O)CN1CCC(CC1)Nc1nccc(n1)-c1cnc2ccccn12
Show InChI InChI=1S/C19H23N7O/c1-20-18(27)13-25-10-6-14(7-11-25)23-19-21-8-5-15(24-19)16-12-22-17-4-2-3-9-26(16)17/h2-5,8-9,12,14H,6-7,10-11,13H2,1H3,(H,20,27)(H,21,23,24)
NCI pathway
Reactome pathway
n/an/a 270n/an/an/an/an/an/a
UCB
Curated by ChEMBL
Assay Description
Inhibition of JNK3 (unknown origin)
Bioorg Med Chem Lett 18: 3291-5 (2008)
Article DOI: 10.1016/j.bmcl.2008.04.039
BindingDB Entry DOI: 10.7270/Q2NZ87FX
3D
3D Structure (crystal)
Interleukin-1 receptor-associated kinase 4
(Homo sapiens (Human))
BDBM50271524
(2-(4-(4-(H-imidazo[1,2-a]pyridin-3-yl)pyrimidin-2-...)
Show SMILES CNC(=O)CN1CCC(CC1)Nc1nccc(n1)-c1cnc2ccccn12
Show InChI InChI=1S/C19H23N7O/c1-20-18(27)13-25-10-6-14(7-11-25)23-19-21-8-5-15(24-19)16-12-22-17-4-2-3-9-26(16)17/h2-5,8-9,12,14H,6-7,10-11,13H2,1H3,(H,20,27)(H,21,23,24)
Reactome pathway
n/an/a 3.00E+3n/an/an/an/an/an/a
UCB
Curated by ChEMBL
Assay Description
Inhibition of IRAK4 (unknown origin)
Bioorg Med Chem Lett 18: 3291-5 (2008)
Article DOI: 10.1016/j.bmcl.2008.04.039
BindingDB Entry DOI: 10.7270/Q2NZ87FX