BDBM50271529 CHEMBL483314::N-[2-(4-(4-Dimethylaminomethylphenyl)phenyl)ethyl]-4-cyanobenzenesulfonamide
SMILES: CN(C)Cc1ccc(cc1)-c1ccc(CCNS(=O)(=O)c2ccc(cc2)C#N)cc1
InChI Key: InChIKey=LOSYVPNNUVUCEL-UHFFFAOYSA-N
Data: 1 IC50
Activity Spreadsheet -- Enzyme Inhibition Constant Data from BindingDB
Found 1 hit for monomerid = 50271529
Trg + Lig
Ki
nM
ΔG°
kcal/mole
IC50
nM
Kd
nM
EC50/IC50
nM
koff
s-1
kon
M-1s-1
pHTemp
°C
Lanosterol synthase
(Homo sapiens (Human))
BDBM50271529
(CHEMBL483314 | N-[2-(4-(4-Dimethylaminomethylpheny...)
Show SMILES CN(C)Cc1ccc(cc1)-c1ccc(CCNS(=O)(=O)c2ccc(cc2)C#N)cc1
Show InChI InChI=1S/C24H25N3O2S/c1-27(2)18-21-5-11-23(12-6-21)22-9-3-19(4-10-22)15-16-26-30(28,29)24-13-7-20(17-25)8-14-24/h3-14,26H,15-16,18H2,1-2H3
Reactome pathway
n/an/a 28n/an/an/an/an/an/a
Laboratoire GlaxoSmithKline
Curated by ChEMBL
Assay Description
Inhibition of 2,3-oxidosqualene-lanosterol cyclase (unknown origin)
Bioorg Med Chem 16: 6218-32 (2008)
Article DOI: 10.1016/j.bmc.2008.04.034
BindingDB Entry DOI: 10.7270/Q2M61K14