BDBM50271530 CHEMBL483918::N-[2-(4-(4-((Pyrolidin-1-yl)methyl)phenyl)phenyl)ethyl]-4-chlorobenzenesulfonamide
SMILES: Clc1ccc(cc1)S(=O)(=O)NCCc1ccc(cc1)-c1ccc(CN2CCCC2)cc1
InChI Key: InChIKey=YDDBKERALRTSKE-UHFFFAOYSA-N
Data: 1 IC50
Activity Spreadsheet -- Enzyme Inhibition Constant Data from BindingDB
Found 1 hit for monomerid = 50271530
Trg + Lig
Ki
nM
ΔG°
kcal/mole
IC50
nM
Kd
nM
EC50/IC50
nM
koff
s-1
kon
M-1s-1
pHTemp
°C
Lanosterol synthase
(Homo sapiens (Human))
BDBM50271530
(CHEMBL483918 | N-[2-(4-(4-((Pyrolidin-1-yl)methyl)...)
Show SMILES Clc1ccc(cc1)S(=O)(=O)NCCc1ccc(cc1)-c1ccc(CN2CCCC2)cc1
Show InChI InChI=1S/C25H27ClN2O2S/c26-24-11-13-25(14-12-24)31(29,30)27-16-15-20-3-7-22(8-4-20)23-9-5-21(6-10-23)19-28-17-1-2-18-28/h3-14,27H,1-2,15-19H2
Reactome pathway
n/an/a 63n/an/an/an/an/an/a
Laboratoire GlaxoSmithKline
Curated by ChEMBL
Assay Description
Inhibition of 2,3-oxidosqualene-lanosterol cyclase (unknown origin)
Bioorg Med Chem 16: 6218-32 (2008)
Article DOI: 10.1016/j.bmc.2008.04.034
BindingDB Entry DOI: 10.7270/Q2M61K14