BDBM50271811 CHEMBL508095::N-((1S,2S)-1-((S)-4-benzyl-3-oxopiperazin-2-yl)-3-(3,5-difluorophenyl)-1-hydroxypropan-2-yl)-3-isopropyl-2-oxo-1-propylimidazolidine-4-carboxamide
SMILES: CCCN1CC(N(C(C)C)C1=O)C(=O)N[C@@H](Cc1cc(F)cc(F)c1)[C@H](O)[C@@H]1NCCN(Cc2ccccc2)C1=O
InChI Key: InChIKey=IMUGWQKSXKEHDO-MBKURTIGSA-N
Data: 2 IC50
Activity Spreadsheet -- Enzyme Inhibition Constant Data from BindingDB
Found 2 hits for monomerid = 50271811
Trg + Lig
Ki
nM
ΔG°
kcal/mole
IC50
nM
Kd
nM
EC50/IC50
nM
koff
s-1
kon
M-1s-1
pHTemp
°C
Beta-secretase 1
(Homo sapiens (Human))
BDBM50271811
(CHEMBL508095 | N-((1S,2S)-1-((S)-4-benzyl-3-oxopip...)
Show SMILES CCCN1CC(N(C(C)C)C1=O)C(=O)N[C@@H](Cc1cc(F)cc(F)c1)[C@H](O)[C@@H]1NCCN(Cc2ccccc2)C1=O |r|
Show InChI InChI=1S/C30H39F2N5O4/c1-4-11-36-18-25(37(19(2)3)30(36)41)28(39)34-24(15-21-13-22(31)16-23(32)14-21)27(38)26-29(40)35(12-10-33-26)17-20-8-6-5-7-9-20/h5-9,13-14,16,19,24-27,33,38H,4,10-12,15,17-18H2,1-3H3,(H,34,39)/t24-,25?,26-,27-/m0/s1
n/an/a 1.10E+3n/an/an/an/an/an/a
Schering-Plough Research Institute
Curated by ChEMBL
Assay Description
Inhibition of BACE1 in HEK293 cells transfected with human APP cDNA containing Swedish ad London FAD mutant assessed as inhibition of amyloid beta 1-...
Bioorg Med Chem Lett 18: 3236-41 (2008)
Article DOI: 10.1016/j.bmcl.2008.04.050
BindingDB Entry DOI: 10.7270/Q2PZ58MR
Beta-secretase 1
(Homo sapiens (Human))
BDBM50271811
(CHEMBL508095 | N-((1S,2S)-1-((S)-4-benzyl-3-oxopip...)
Show SMILES CCCN1CC(N(C(C)C)C1=O)C(=O)N[C@@H](Cc1cc(F)cc(F)c1)[C@H](O)[C@@H]1NCCN(Cc2ccccc2)C1=O |r|
Show InChI InChI=1S/C30H39F2N5O4/c1-4-11-36-18-25(37(19(2)3)30(36)41)28(39)34-24(15-21-13-22(31)16-23(32)14-21)27(38)26-29(40)35(12-10-33-26)17-20-8-6-5-7-9-20/h5-9,13-14,16,19,24-27,33,38H,4,10-12,15,17-18H2,1-3H3,(H,34,39)/t24-,25?,26-,27-/m0/s1
n/an/a 11n/an/an/an/an/an/a
Schering-Plough Research Institute
Curated by ChEMBL
Assay Description
Inhibition of BACE1 (unknown origin)
Bioorg Med Chem Lett 18: 3236-41 (2008)
Article DOI: 10.1016/j.bmcl.2008.04.050
BindingDB Entry DOI: 10.7270/Q2PZ58MR