BDBM50271814 CHEMBL522924::N1-((1S,2S)-3-(3,5-difluorophenyl)-1-hydroxy-1-((S)-4-methyl-3-oxopiperazin-2-yl)propan-2-yl)-5-methyl-N3,N3-dipropylisophthalamide
SMILES: CCCN(CCC)C(=O)c1cc(C)cc(c1)C(=O)N[C@@H](Cc1cc(F)cc(F)c1)[C@H](O)[C@@H]1NCCN(C)C1=O
InChI Key: InChIKey=VYOHMKLTWNCCJC-GSDHBNRESA-N
Data: 2 IC50
Activity Spreadsheet -- Enzyme Inhibition Constant Data from BindingDB
Found 2 hits for monomerid = 50271814
Trg + Lig
Ki
nM
ΔG°
kcal/mole
IC50
nM
Kd
nM
EC50/IC50
nM
koff
s-1
kon
M-1s-1
pHTemp
°C
Beta-secretase 1
(Homo sapiens (Human))
BDBM50271814
(CHEMBL522924 | N1-((1S,2S)-3-(3,5-difluorophenyl)-...)
Show SMILES CCCN(CCC)C(=O)c1cc(C)cc(c1)C(=O)N[C@@H](Cc1cc(F)cc(F)c1)[C@H](O)[C@@H]1NCCN(C)C1=O |r|
Show InChI InChI=1S/C29H38F2N4O4/c1-5-8-35(9-6-2)28(38)21-12-18(3)11-20(16-21)27(37)33-24(15-19-13-22(30)17-23(31)14-19)26(36)25-29(39)34(4)10-7-32-25/h11-14,16-17,24-26,32,36H,5-10,15H2,1-4H3,(H,33,37)/t24-,25-,26-/m0/s1
n/an/a 7.00E+3n/an/an/an/an/an/a
Schering-Plough Research Institute
Curated by ChEMBL
Assay Description
Inhibition of BACE1 in HEK293 cells transfected with human APP cDNA containing Swedish ad London FAD mutant assessed as inhibition of amyloid beta 1-...
Bioorg Med Chem Lett 18: 3236-41 (2008)
Article DOI: 10.1016/j.bmcl.2008.04.050
BindingDB Entry DOI: 10.7270/Q2PZ58MR
Beta-secretase 1
(Homo sapiens (Human))
BDBM50271814
(CHEMBL522924 | N1-((1S,2S)-3-(3,5-difluorophenyl)-...)
Show SMILES CCCN(CCC)C(=O)c1cc(C)cc(c1)C(=O)N[C@@H](Cc1cc(F)cc(F)c1)[C@H](O)[C@@H]1NCCN(C)C1=O |r|
Show InChI InChI=1S/C29H38F2N4O4/c1-5-8-35(9-6-2)28(38)21-12-18(3)11-20(16-21)27(37)33-24(15-19-13-22(30)17-23(31)14-19)26(36)25-29(39)34(4)10-7-32-25/h11-14,16-17,24-26,32,36H,5-10,15H2,1-4H3,(H,33,37)/t24-,25-,26-/m0/s1
n/an/a 235n/an/an/an/an/an/a
Schering-Plough Research Institute
Curated by ChEMBL
Assay Description
Inhibition of BACE1 (unknown origin)
Bioorg Med Chem Lett 18: 3236-41 (2008)
Article DOI: 10.1016/j.bmcl.2008.04.050
BindingDB Entry DOI: 10.7270/Q2PZ58MR