BDBM50271957 (3R,6R)-3-Cyclohexyl-6-(4-methoxy-benzyl)-7-(4-methyl-cyclohexylmethyl)-2,5,6,7-tetrahydro-3H-imidazo[1,2-a]imidazol-1-ium
SMILES: COc1ccc(C[C@@H]2CN3[C@@H](C[NH+]=C3N2CC2CCC(C)CC2)C2CCCCC2)cc1
InChI Key: InChIKey=OPNCBMYHRCYEGA-CZAHGJGASA-O
Data: 2 IC50
Activity Spreadsheet -- Enzyme Inhibition Constant Data from BindingDB
Found 2 hits for monomerid = 50271957
Trg + Lig
Ki
nM
ΔG°
kcal/mole
IC50
nM
Kd
nM
EC50/IC50
nM
koff
s-1
kon
M-1s-1
pHTemp
°C
Kappa-type opioid receptor
(Cavia porcellus (domestic guinea pig))
BDBM50271957
((3R,6R)-3-Cyclohexyl-6-(4-methoxy-benzyl)-7-(4-met...)
Show SMILES COc1ccc(C[C@@H]2CN3[C@@H](C[NH+]=C3N2CC2CCC(C)CC2)C2CCCCC2)cc1 |r,wU:7.6,10.25,c:12,(5.32,1,;3.78,1.03,;2.98,-.28,;3.71,-1.64,;2.91,-2.95,;1.37,-2.9,;.57,-4.21,;-.97,-4.17,;-1.84,-2.9,;-3.32,-3.34,;-4.78,-2.82,;-5.72,-4.05,;-4.85,-5.32,;-3.36,-4.88,;-1.91,-5.4,;-1.47,-6.88,;.03,-7.24,;.46,-8.72,;1.95,-9.08,;3.02,-7.97,;4.51,-8.33,;2.58,-6.49,;1.08,-6.12,;-5.22,-1.34,;-4.16,-.23,;-4.59,1.24,;-6.09,1.6,;-7.15,.49,;-6.72,-1,;.63,-1.56,;1.43,-.25,)|
Show InChI InChI=1S/C27H41N3O/c1-20-8-10-22(11-9-20)18-29-24(16-21-12-14-25(31-2)15-13-21)19-30-26(17-28-27(29)30)23-6-4-3-5-7-23/h12-15,20,22-24,26H,3-11,16-19H2,1-2H3/p+1/t20?,22?,24-,26+/m1/s1
n/an/a 362n/an/an/an/an/an/a
Torrey Pines Institute for Molecular Studies
Curated by ChEMBL
Assay Description
Displacement of [3H]U69593 from kappa opioid receptor in guinea pig brain homogenate
Bioorg Med Chem 16: 5932-8 (2008)
Article DOI: 10.1016/j.bmc.2008.04.061
BindingDB Entry DOI: 10.7270/Q2BG2PW7
Kappa-type opioid receptor
(Homo sapiens (Human))
BDBM50271957
((3R,6R)-3-Cyclohexyl-6-(4-methoxy-benzyl)-7-(4-met...)
Show SMILES COc1ccc(C[C@@H]2CN3[C@@H](C[NH+]=C3N2CC2CCC(C)CC2)C2CCCCC2)cc1 |r,wU:7.6,10.25,c:12,(5.32,1,;3.78,1.03,;2.98,-.28,;3.71,-1.64,;2.91,-2.95,;1.37,-2.9,;.57,-4.21,;-.97,-4.17,;-1.84,-2.9,;-3.32,-3.34,;-4.78,-2.82,;-5.72,-4.05,;-4.85,-5.32,;-3.36,-4.88,;-1.91,-5.4,;-1.47,-6.88,;.03,-7.24,;.46,-8.72,;1.95,-9.08,;3.02,-7.97,;4.51,-8.33,;2.58,-6.49,;1.08,-6.12,;-5.22,-1.34,;-4.16,-.23,;-4.59,1.24,;-6.09,1.6,;-7.15,.49,;-6.72,-1,;.63,-1.56,;1.43,-.25,)|
Show InChI InChI=1S/C27H41N3O/c1-20-8-10-22(11-9-20)18-29-24(16-21-12-14-25(31-2)15-13-21)19-30-26(17-28-27(29)30)23-6-4-3-5-7-23/h12-15,20,22-24,26H,3-11,16-19H2,1-2H3/p+1/t20?,22?,24-,26+/m1/s1
Reactome pathway
n/an/a 362n/an/an/an/an/an/a
Torrey Pines Institute for Molecular Studies
Curated by ChEMBL
Assay Description
Inhibitory activity for kappa opioid receptor
J Med Chem 42: 3743-78 (1999)
BindingDB Entry DOI: 10.7270/Q22Z167W