BDBM50271981 1-(3-fluoro-4-(3-(pyridin-3-yl)-1H-pyrrolo[2,3-b]pyridin-4-yloxy)phenyl)-3-(2-(4-fluorophenyl)acetyl)urea::CHEMBL524364
SMILES: Fc1ccc(CC(=O)NC(=O)Nc2ccc(Oc3ccnc4[nH]cc(-c5cccnc5)c34)c(F)c2)cc1
InChI Key: InChIKey=YHRODYLKVZIFSW-UHFFFAOYSA-N
Data: 3 IC50
Activity Spreadsheet -- Enzyme Inhibition Constant Data from BindingDB
Found 3 hits for monomerid = 50271981
Trg + Lig
Ki
nM
ΔG°
kcal/mole
IC50
nM
Kd
nM
EC50/IC50
nM
koff
s-1
kon
M-1s-1
pHTemp
°C
Hepatocyte growth factor receptor
(Homo sapiens (Human))
BDBM50271981
(1-(3-fluoro-4-(3-(pyridin-3-yl)-1H-pyrrolo[2,3-b]p...)
Show SMILES Fc1ccc(CC(=O)NC(=O)Nc2ccc(Oc3ccnc4[nH]cc(-c5cccnc5)c34)c(F)c2)cc1
Show InChI InChI=1S/C27H19F2N5O3/c28-18-5-3-16(4-6-18)12-24(35)34-27(36)33-19-7-8-22(21(29)13-19)37-23-9-11-31-26-25(23)20(15-32-26)17-2-1-10-30-14-17/h1-11,13-15H,12H2,(H,31,32)(H2,33,34,35,36)
n/an/a 2n/an/an/an/an/an/a
Fudan University
Curated by ChEMBL
Assay Description
Inhibition of c-Met (unknown origin)
Eur J Med Chem 80: 254-66 (2014)
Article DOI: 10.1016/j.ejmech.2014.04.056
BindingDB Entry DOI: 10.7270/Q2930VQ6
Hepatocyte growth factor receptor
(Homo sapiens (Human))
BDBM50271981
(1-(3-fluoro-4-(3-(pyridin-3-yl)-1H-pyrrolo[2,3-b]p...)
Show SMILES Fc1ccc(CC(=O)NC(=O)Nc2ccc(Oc3ccnc4[nH]cc(-c5cccnc5)c34)c(F)c2)cc1
Show InChI InChI=1S/C27H19F2N5O3/c28-18-5-3-16(4-6-18)12-24(35)34-27(36)33-19-7-8-22(21(29)13-19)37-23-9-11-31-26-25(23)20(15-32-26)17-2-1-10-30-14-17/h1-11,13-15H,12H2,(H,31,32)(H2,33,34,35,36)
n/an/a 2n/an/an/an/an/an/a
Sichuan University
Curated by ChEMBL
Assay Description
Inhibition of human c-MET
Eur J Med Chem 46: 3675-80 (2011)
Article DOI: 10.1016/j.ejmech.2011.05.031
BindingDB Entry DOI: 10.7270/Q2891676
Hepatocyte growth factor receptor
(Homo sapiens (Human))
BDBM50271981
(1-(3-fluoro-4-(3-(pyridin-3-yl)-1H-pyrrolo[2,3-b]p...)
Show SMILES Fc1ccc(CC(=O)NC(=O)Nc2ccc(Oc3ccnc4[nH]cc(-c5cccnc5)c34)c(F)c2)cc1
Show InChI InChI=1S/C27H19F2N5O3/c28-18-5-3-16(4-6-18)12-24(35)34-27(36)33-19-7-8-22(21(29)13-19)37-23-9-11-31-26-25(23)20(15-32-26)17-2-1-10-30-14-17/h1-11,13-15H,12H2,(H,31,32)(H2,33,34,35,36)
n/an/a 2n/an/an/an/an/an/a
Bristol-Myers Squibb Research and Development
Curated by ChEMBL
Assay Description
Inhibition of Met kinase (unknown origin)
Bioorg Med Chem Lett 18: 3224-9 (2008)
Article DOI: 10.1016/j.bmcl.2008.04.047
BindingDB Entry DOI: 10.7270/Q2XG9QX1