BDBM50272034 (2R,5R)-5-cyclohexyl-1-[(4-methylcyclohexyl)methyl]-2-(2-methylpropyl)-1H,2H,3H,5H,6H-imidazo[1,2-a]imidazolidin-7-ium
SMILES: CC(C)CC1C[N+]2=C(NCC2C2CCCCC2)N1CC1CCC(C)CC1
InChI Key: InChIKey=YUFCTXRFOLKQOF-UHFFFAOYSA-O
Data: 2 IC50
Activity Spreadsheet -- Enzyme Inhibition Constant Data from BindingDB
Found 2 hits for monomerid = 50272034
Trg + Lig
Ki
nM
ΔG°
kcal/mole
IC50
nM
Kd
nM
EC50/IC50
nM
koff
s-1
kon
M-1s-1
pHTemp
°C
Kappa-type opioid receptor
(Cavia porcellus (domestic guinea pig))
BDBM50272034
((2R,5R)-5-cyclohexyl-1-[(4-methylcyclohexyl)methyl...)
Show SMILES CC(C)CC1C[N+]2=C(NCC2C2CCCCC2)N1CC1CCC(C)CC1 |t:6,(-.57,1.19,;.17,-.16,;1.71,-.2,;-.63,-1.47,;-2.17,-1.44,;-3.05,-.17,;-4.52,-.6,;-4.57,-2.15,;-6.05,-2.59,;-6.92,-1.32,;-5.98,-.08,;-6.42,1.39,;-5.36,2.5,;-5.79,3.98,;-7.29,4.34,;-8.36,3.22,;-7.92,1.74,;-3.11,-2.66,;-2.67,-4.14,;-3.73,-5.26,;-5.23,-4.9,;-6.28,-6.01,;-5.85,-7.49,;-6.91,-8.61,;-4.35,-7.85,;-3.29,-6.74,)|
Show InChI InChI=1S/C23H41N3/c1-17(2)13-21-16-26-22(20-7-5-4-6-8-20)14-24-23(26)25(21)15-19-11-9-18(3)10-12-19/h17-22H,4-16H2,1-3H3/p+1
n/an/a 738n/an/an/an/an/an/a
Torrey Pines Institute for Molecular Studies
Curated by ChEMBL
Assay Description
Displacement of [3H]U69593 from kappa opioid receptor in guinea pig brain homogenate
Bioorg Med Chem 16: 5932-8 (2008)
Article DOI: 10.1016/j.bmc.2008.04.061
BindingDB Entry DOI: 10.7270/Q2BG2PW7
Kappa-type opioid receptor
(Homo sapiens (Human))
BDBM50272034
((2R,5R)-5-cyclohexyl-1-[(4-methylcyclohexyl)methyl...)
Show SMILES CC(C)CC1C[N+]2=C(NCC2C2CCCCC2)N1CC1CCC(C)CC1 |t:6,(-.57,1.19,;.17,-.16,;1.71,-.2,;-.63,-1.47,;-2.17,-1.44,;-3.05,-.17,;-4.52,-.6,;-4.57,-2.15,;-6.05,-2.59,;-6.92,-1.32,;-5.98,-.08,;-6.42,1.39,;-5.36,2.5,;-5.79,3.98,;-7.29,4.34,;-8.36,3.22,;-7.92,1.74,;-3.11,-2.66,;-2.67,-4.14,;-3.73,-5.26,;-5.23,-4.9,;-6.28,-6.01,;-5.85,-7.49,;-6.91,-8.61,;-4.35,-7.85,;-3.29,-6.74,)|
Show InChI InChI=1S/C23H41N3/c1-17(2)13-21-16-26-22(20-7-5-4-6-8-20)14-24-23(26)25(21)15-19-11-9-18(3)10-12-19/h17-22H,4-16H2,1-3H3/p+1
Reactome pathway
n/an/a 738n/an/an/an/an/an/a
Torrey Pines Institute for Molecular Studies
Curated by ChEMBL
Assay Description
Inhibitory activity for kappa opioid receptor
J Med Chem 42: 3743-78 (1999)
BindingDB Entry DOI: 10.7270/Q22Z167W