BDBM50272054 CHEMBL4129589
SMILES: C(CCOc1cccc2ccccc12)CCN1CCCCCC1
InChI Key: InChIKey=CDPGITMKSDQGJF-UHFFFAOYSA-N
Data: 4 KI  1 IC50
Activity Spreadsheet -- Enzyme Inhibition Constant Data from BindingDB
Found 5 hits for monomerid = 50272054
Trg + Lig
Ki
nM
ΔG°
kcal/mole
IC50
nM
Kd
nM
EC50/IC50
nM
koff
s-1
kon
M-1s-1
pHTemp
°C
Histamine H3 receptor
(Homo sapiens (Human))
BDBM50272054
(CHEMBL4129589)
Show SMILES C(CCOc1cccc2ccccc12)CCN1CCCCCC1
Show InChI InChI=1S/C21H29NO/c1-2-7-16-22(15-6-1)17-8-3-9-18-23-21-14-10-12-19-11-4-5-13-20(19)21/h4-5,10-14H,1-3,6-9,15-18H2
Reactome pathway
22n/an/an/an/an/an/an/an/a
Jagiellonian University Medical College
Curated by ChEMBL
Assay Description
Displacement of [3H]N-alpha-methylhistamine from full length human H3 receptor expressed in HEK293 cell membranes after 90 mins
Bioorg Med Chem 26: 2573-2585 (2018)
Article DOI: 10.1016/j.bmc.2018.04.023
BindingDB Entry DOI: 10.7270/Q2TQ641P
5-hydroxytryptamine receptor 6
(Homo sapiens (Human))
BDBM50272054
(CHEMBL4129589)
Show SMILES C(CCOc1cccc2ccccc12)CCN1CCCCCC1
Show InChI InChI=1S/C21H29NO/c1-2-7-16-22(15-6-1)17-8-3-9-18-23-21-14-10-12-19-11-4-5-13-20(19)21/h4-5,10-14H,1-3,6-9,15-18H2
Reactome pathway
1.84E+3n/an/an/an/an/an/an/an/a
Jagiellonian University Medical College
Curated by ChEMBL
Assay Description
Displacement of [3H]-LSD from human 5-HT6 receptor expressed in HEK293 cell membranes after 1 hr
Bioorg Med Chem 26: 2573-2585 (2018)
Article DOI: 10.1016/j.bmc.2018.04.023
BindingDB Entry DOI: 10.7270/Q2TQ641P
5-hydroxytryptamine receptor 2A
(Homo sapiens (Human))
BDBM50272054
(CHEMBL4129589)
Show SMILES C(CCOc1cccc2ccccc12)CCN1CCCCCC1
Show InChI InChI=1S/C21H29NO/c1-2-7-16-22(15-6-1)17-8-3-9-18-23-21-14-10-12-19-11-4-5-13-20(19)21/h4-5,10-14H,1-3,6-9,15-18H2
Reactome pathway
2.61E+3n/an/an/an/an/an/an/an/a
Jagiellonian University Medical College
Curated by ChEMBL
Assay Description
Displacement of [3H]-ketanserin from human 5-HT2A receptor expressed in CHO cell membranes after 1 hr
Bioorg Med Chem 26: 2573-2585 (2018)
Article DOI: 10.1016/j.bmc.2018.04.023
BindingDB Entry DOI: 10.7270/Q2TQ641P
5-hydroxytryptamine receptor 7
(Homo sapiens (Human))
BDBM50272054
(CHEMBL4129589)
Show SMILES C(CCOc1cccc2ccccc12)CCN1CCCCCC1
Show InChI InChI=1S/C21H29NO/c1-2-7-16-22(15-6-1)17-8-3-9-18-23-21-14-10-12-19-11-4-5-13-20(19)21/h4-5,10-14H,1-3,6-9,15-18H2
Reactome pathway
2.80E+3n/an/an/an/an/an/an/an/a
Jagiellonian University Medical College
Curated by ChEMBL
Assay Description
Displacement of [3H]-5-carboxyamidotryptamine from human 5-HT7 receptor expressed in HEK293 cell membranes after 1 hr
Bioorg Med Chem 26: 2573-2585 (2018)
Article DOI: 10.1016/j.bmc.2018.04.023
BindingDB Entry DOI: 10.7270/Q2TQ641P
Histamine H3 receptor
(Homo sapiens (Human))
BDBM50272054
(CHEMBL4129589)
Show SMILES C(CCOc1cccc2ccccc12)CCN1CCCCCC1
Show InChI InChI=1S/C21H29NO/c1-2-7-16-22(15-6-1)17-8-3-9-18-23-21-14-10-12-19-11-4-5-13-20(19)21/h4-5,10-14H,1-3,6-9,15-18H2
Reactome pathway
n/an/a 312n/an/an/an/an/an/a
Jagiellonian University Medical College
Curated by ChEMBL
Assay Description
Antagonist activity at human H3 receptor expressed in HEK293 cells assessed as inhibition of RAMH-induced reduction of forskolin-stimulated cAMP accu...
Bioorg Med Chem 26: 2573-2585 (2018)
Article DOI: 10.1016/j.bmc.2018.04.023
BindingDB Entry DOI: 10.7270/Q2TQ641P