BDBM50272096 3-(4-methoxyphenyl)-2-(4-(methylsulfonyl)phenyl)-1H-indole::CHEMBL499069
SMILES: COc1ccc(cc1)-c1c([nH]c2ccccc12)-c1ccc(cc1)S(C)(=O)=O
InChI Key: InChIKey=COKDBCCJSNVXKO-UHFFFAOYSA-N
Data: 3 IC50
Activity Spreadsheet -- Enzyme Inhibition Constant Data from BindingDB
Found 3 hits for monomerid = 50272096
Trg + Lig
Ki
nM
ΔG°
kcal/mole
IC50
nM
Kd
nM
EC50/IC50
nM
koff
s-1
kon
M-1s-1
pHTemp
°C
Cyclooxygenase
(Homo sapiens (Human))
BDBM50272096
(3-(4-methoxyphenyl)-2-(4-(methylsulfonyl)phenyl)-1...)
Show SMILES COc1ccc(cc1)-c1c([nH]c2ccccc12)-c1ccc(cc1)S(C)(=O)=O
Show InChI InChI=1S/C22H19NO3S/c1-26-17-11-7-15(8-12-17)21-19-5-3-4-6-20(19)23-22(21)16-9-13-18(14-10-16)27(2,24)25/h3-14,23H,1-2H3
NCI pathway
Reactome pathway
n/an/a 0.0200n/an/an/an/an/an/a
Institute of Technology and Science
Curated by ChEMBL
Assay Description
Inhibition of COX2 (unknown origin)
Eur J Med Chem 43: 1297-303 (2008)
Article DOI: 10.1016/j.ejmech.2007.06.022
BindingDB Entry DOI: 10.7270/Q2CC10F1
Prostaglandin G/H synthase (cyclooxygenase)
(Mus musculus (Mouse))
BDBM50272096
(3-(4-methoxyphenyl)-2-(4-(methylsulfonyl)phenyl)-1...)
Show SMILES COc1ccc(cc1)-c1c([nH]c2ccccc12)-c1ccc(cc1)S(C)(=O)=O
Show InChI InChI=1S/C22H19NO3S/c1-26-17-11-7-15(8-12-17)21-19-5-3-4-6-20(19)23-22(21)16-9-13-18(14-10-16)27(2,24)25/h3-14,23H,1-2H3
n/an/a 0.0200n/an/an/an/an/an/a
TBA
Assay Description
Inhibition of COX2 in Mus musculus (mouse) peritoneal macrophage
Citation and Details
Article DOI: 10.1007/s00044-008-9117-0
BindingDB Entry DOI: 10.7270/Q25T3PBB
Cyclooxygenase
(Homo sapiens (Human))
BDBM50272096
(3-(4-methoxyphenyl)-2-(4-(methylsulfonyl)phenyl)-1...)
Show SMILES COc1ccc(cc1)-c1c([nH]c2ccccc12)-c1ccc(cc1)S(C)(=O)=O
Show InChI InChI=1S/C22H19NO3S/c1-26-17-11-7-15(8-12-17)21-19-5-3-4-6-20(19)23-22(21)16-9-13-18(14-10-16)27(2,24)25/h3-14,23H,1-2H3
NCI pathway
Reactome pathway
n/an/a 20n/an/an/an/an/an/a
Helmholtz-Zentrum Dresden-Rossendorf
Curated by ChEMBL
Assay Description
Inhibition of COX2
Bioorg Med Chem 20: 3410-21 (2012)
Article DOI: 10.1016/j.bmc.2012.04.022
BindingDB Entry DOI: 10.7270/Q2RF5W3X