BDBM50272173 CHEMBL526322::N-(9-Ethyl-9H-carbazol-3-yl)-3-(3-(2-isopropylphenyl)-1,2,4-oxadiazol-5-yl)propanamide
SMILES: CCn1c2ccccc2c2cc(NC(=O)CCc3nc(no3)-c3ccccc3C(C)C)ccc12
InChI Key: InChIKey=HMKYVRMYZWQBIC-UHFFFAOYSA-N
Data: 2 EC50
Activity Spreadsheet -- Enzyme Inhibition Constant Data from BindingDB
Found 2 hits for monomerid = 50272173
Trg + Lig
Ki
nM
ΔG°
kcal/mole
IC50
nM
Kd
nM
EC50/IC50
nM
koff
s-1
kon
M-1s-1
pHTemp
°C
Cannabinoid receptor 2
(Homo sapiens (Human))
BDBM50272173
(CHEMBL526322 | N-(9-Ethyl-9H-carbazol-3-yl)-3-(3-(...)
Show SMILES CCn1c2ccccc2c2cc(NC(=O)CCc3nc(no3)-c3ccccc3C(C)C)ccc12
Show InChI InChI=1S/C28H28N4O2/c1-4-32-24-12-8-7-10-21(24)23-17-19(13-14-25(23)32)29-26(33)15-16-27-30-28(31-34-27)22-11-6-5-9-20(22)18(2)3/h5-14,17-18H,4,15-16H2,1-3H3,(H,29,33)
Reactome pathway
n/an/an/an/a 670n/an/an/an/a
Amgen Inc.
Curated by ChEMBL
Assay Description
Agonist activity at human recombinant CB2 receptor expressed in Sf9 cells by GTP-europium binding assay
J Med Chem 51: 5019-34 (2008)
Article DOI: 10.1021/jm800463f
BindingDB Entry DOI: 10.7270/Q2W096VS
Cannabinoid receptor 1
(Homo sapiens (Human))
BDBM50272173
(CHEMBL526322 | N-(9-Ethyl-9H-carbazol-3-yl)-3-(3-(...)
Show SMILES CCn1c2ccccc2c2cc(NC(=O)CCc3nc(no3)-c3ccccc3C(C)C)ccc12
Show InChI InChI=1S/C28H28N4O2/c1-4-32-24-12-8-7-10-21(24)23-17-19(13-14-25(23)32)29-26(33)15-16-27-30-28(31-34-27)22-11-6-5-9-20(22)18(2)3/h5-14,17-18H,4,15-16H2,1-3H3,(H,29,33)
NCI pathway
Reactome pathway
n/an/an/an/a>1.00E+4n/an/an/an/a
Amgen Inc.
Curated by ChEMBL
Assay Description
Agonist activity at human CB1 receptor expressed in Sf9 cells by GTP-europium binding assay
J Med Chem 51: 5019-34 (2008)
Article DOI: 10.1021/jm800463f
BindingDB Entry DOI: 10.7270/Q2W096VS