BDBM50272225 CHEMBL448360::H-Dmt-Tic-Asp-N(Me)-Ph
SMILES: CN(C(=O)[C@H](CC(O)=O)NC(=O)[C@@H]1Cc2ccccc2CN1C(=O)[C@@H](N)Cc1c(C)cc(O)cc1C)c1ccccc1
InChI Key: InChIKey=HEKBLCZSNQVJKZ-KCHLEUMXSA-N
Data: 2 KI  1 IC50
Activity Spreadsheet -- Enzyme Inhibition Constant Data from BindingDB
Found 3 hits for monomerid = 50272225
Trg + Lig
Ki
nM
ΔG°
kcal/mole
IC50
nM
Kd
nM
EC50/IC50
nM
koff
s-1
kon
M-1s-1
pHTemp
°C
Opioid receptors; mu & delta
(Rattus norvegicus (rat))
BDBM50272225
(CHEMBL448360 | H-Dmt-Tic-Asp-N(Me)-Ph)
Show SMILES CN(C(=O)[C@H](CC(O)=O)NC(=O)[C@@H]1Cc2ccccc2CN1C(=O)[C@@H](N)Cc1c(C)cc(O)cc1C)c1ccccc1 |r|
Show InChI InChI=1S/C32H36N4O6/c1-19-13-24(37)14-20(2)25(19)16-26(33)31(41)36-18-22-10-8-7-9-21(22)15-28(36)30(40)34-27(17-29(38)39)32(42)35(3)23-11-5-4-6-12-23/h4-14,26-28,37H,15-18,33H2,1-3H3,(H,34,40)(H,38,39)/t26-,27-,28-/m0/s1
Reactome pathway
0.186n/an/an/an/an/an/an/an/a
University of Cagliari
Curated by ChEMBL
Assay Description
Displacement of [3H]deltorphin2 from delta opioid receptor in Sprague-Dawley rat brain P2 synaptosomal membrane
J Med Chem 51: 5109-17 (2008)
Article DOI: 10.1021/jm800587e
BindingDB Entry DOI: 10.7270/Q2DB81NR
Mu-type opioid receptor
(Rattus norvegicus (rat))
BDBM50272225
(CHEMBL448360 | H-Dmt-Tic-Asp-N(Me)-Ph)
Show SMILES CN(C(=O)[C@H](CC(O)=O)NC(=O)[C@@H]1Cc2ccccc2CN1C(=O)[C@@H](N)Cc1c(C)cc(O)cc1C)c1ccccc1 |r|
Show InChI InChI=1S/C32H36N4O6/c1-19-13-24(37)14-20(2)25(19)16-26(33)31(41)36-18-22-10-8-7-9-21(22)15-28(36)30(40)34-27(17-29(38)39)32(42)35(3)23-11-5-4-6-12-23/h4-14,26-28,37H,15-18,33H2,1-3H3,(H,34,40)(H,38,39)/t26-,27-,28-/m0/s1
Reactome pathway
364n/an/an/an/an/an/an/an/a
University of Cagliari
Curated by ChEMBL
Assay Description
Displacement of [3H]DAMGO from mu opioid receptor in Sprague-Dawley rat brain P2 synaptosomal membrane
J Med Chem 51: 5109-17 (2008)
Article DOI: 10.1021/jm800587e
BindingDB Entry DOI: 10.7270/Q2DB81NR
Delta-type opioid receptor
(MOUSE)
BDBM50272225
(CHEMBL448360 | H-Dmt-Tic-Asp-N(Me)-Ph)
Show SMILES CN(C(=O)[C@H](CC(O)=O)NC(=O)[C@@H]1Cc2ccccc2CN1C(=O)[C@@H](N)Cc1c(C)cc(O)cc1C)c1ccccc1 |r|
Show InChI InChI=1S/C32H36N4O6/c1-19-13-24(37)14-20(2)25(19)16-26(33)31(41)36-18-22-10-8-7-9-21(22)15-28(36)30(40)34-27(17-29(38)39)32(42)35(3)23-11-5-4-6-12-23/h4-14,26-28,37H,15-18,33H2,1-3H3,(H,34,40)(H,38,39)/t26-,27-,28-/m0/s1
Reactome pathway
n/an/a>1.00E+4n/an/an/an/an/an/a
University of Cagliari
Curated by ChEMBL
Assay Description
Agonist activity at delta opioid receptor in mouse vas deferens assessed as inhibition of electrically-stimulated muscle contraction
J Med Chem 51: 5109-17 (2008)
Article DOI: 10.1021/jm800587e
BindingDB Entry DOI: 10.7270/Q2DB81NR