BDBM50272366 3-(1-Methoxyethyl)-5-(6-methoxynaphthalen-2-yl)pyridine::CHEMBL500392
SMILES: COC(C)c1cncc(c1)-c1ccc2cc(OC)ccc2c1
InChI Key: InChIKey=OMFRIZLPVDHNSI-UHFFFAOYSA-N
Data: 2 IC50
Activity Spreadsheet -- Enzyme Inhibition Constant Data from BindingDB
Found 2 hits for monomerid = 50272366
Trg + Lig
Ki
nM
ΔG°
kcal/mole
IC50
nM
Kd
nM
EC50/IC50
nM
koff
s-1
kon
M-1s-1
pHTemp
°C
Cytochrome P450 11B1, mitochondrial
(Homo sapiens (Human))
BDBM50272366
(3-(1-Methoxyethyl)-5-(6-methoxynaphthalen-2-yl)pyr...)
Show SMILES COC(C)c1cncc(c1)-c1ccc2cc(OC)ccc2c1
Show InChI InChI=1S/C19H19NO2/c1-13(21-2)17-9-18(12-20-11-17)15-4-5-16-10-19(22-3)7-6-14(16)8-15/h4-13H,1-3H3
n/an/a 10n/an/an/an/an/an/a
Saarland University
Curated by ChEMBL
Assay Description
Inhibition of human CYP11B1 expressed in hamster V79 MZh cells
J Med Chem 51: 5064-74 (2008)
Article DOI: 10.1021/jm800377h
BindingDB Entry DOI: 10.7270/Q2Z89C75
Cytochrome P450 11B2, mitochondrial
(Homo sapiens (Human))
BDBM50272366
(3-(1-Methoxyethyl)-5-(6-methoxynaphthalen-2-yl)pyr...)
Show SMILES COC(C)c1cncc(c1)-c1ccc2cc(OC)ccc2c1
Show InChI InChI=1S/C19H19NO2/c1-13(21-2)17-9-18(12-20-11-17)15-4-5-16-10-19(22-3)7-6-14(16)8-15/h4-13H,1-3H3
n/an/a 0.200n/an/an/an/an/an/a
Saarland University
Curated by ChEMBL
Assay Description
Inhibition of human CYP11B2 expressed in hamster V79 MZh cells
J Med Chem 51: 5064-74 (2008)
Article DOI: 10.1021/jm800377h
BindingDB Entry DOI: 10.7270/Q2Z89C75