BDBM50272400 (8S,9R,10S,11S,13S,14S,16S,17R)-9-fluoro-11-hydroxy-17-(2-hydroxyacetyl)-10,13,16-trimethyl-3-oxo-6,7,8,9,10,11,12,13,14,15,16,17-dodecahydro-3H-cyclopenta[a]phenanthren-17-yl pentylcarbamate::CHEMBL499630
SMILES: CCCCCNC(=O)O[C@@]1([C@@H](C)C[C@H]2[C@@H]3CCC4=CC(=O)C=C[C@]4(C)[C@@]3(F)[C@@H](O)C[C@]12C)C(=O)CO
InChI Key: InChIKey=PXEYRAVUWVPDKI-DGAWKMIRSA-N
Data: 1 IC50  2 EC50
Activity Spreadsheet -- Enzyme Inhibition Constant Data from BindingDB
Found 3 hits for monomerid = 50272400
Trg + Lig
Ki
nM
ΔG°
kcal/mole
IC50
nM
Kd
nM
EC50/IC50
nM
koff
s-1
kon
M-1s-1
pHTemp
°C
Interstitial collagenase
(Homo sapiens (Human))
BDBM50272400
((8S,9R,10S,11S,13S,14S,16S,17R)-9-fluoro-11-hydrox...)
Show SMILES CCCCCNC(=O)O[C@@]1([C@@H](C)C[C@H]2[C@@H]3CCC4=CC(=O)C=C[C@]4(C)[C@@]3(F)[C@@H](O)C[C@]12C)C(=O)CO |r,c:21,t:17|
Show InChI InChI=1S/C28H40FNO6/c1-5-6-7-12-30-24(35)36-28(23(34)16-31)17(2)13-21-20-9-8-18-14-19(32)10-11-25(18,3)27(20,29)22(33)15-26(21,28)4/h10-11,14,17,20-22,31,33H,5-9,12-13,15-16H2,1-4H3,(H,30,35)/t17-,20-,21-,22-,25-,26-,27-,28-/m0/s1
Reactome pathway
n/an/an/an/a 18n/an/an/an/a
Merck Research Laboratories
Curated by ChEMBL
Assay Description
Inhibition of glucocorticoid-mediated human MMP1 expression in PMA stimulated A549 cells assessed as MMP1 protein level by ELISA
Bioorg Med Chem 16: 7535-42 (2008)
Article DOI: 10.1016/j.bmc.2008.07.037
BindingDB Entry DOI: 10.7270/Q2CC10HX
Tyrosine aminotransferase
(Rattus norvegicus)
BDBM50272400
((8S,9R,10S,11S,13S,14S,16S,17R)-9-fluoro-11-hydrox...)
Show SMILES CCCCCNC(=O)O[C@@]1([C@@H](C)C[C@H]2[C@@H]3CCC4=CC(=O)C=C[C@]4(C)[C@@]3(F)[C@@H](O)C[C@]12C)C(=O)CO |r,c:21,t:17|
Show InChI InChI=1S/C28H40FNO6/c1-5-6-7-12-30-24(35)36-28(23(34)16-31)17(2)13-21-20-9-8-18-14-19(32)10-11-25(18,3)27(20,29)22(33)15-26(21,28)4/h10-11,14,17,20-22,31,33H,5-9,12-13,15-16H2,1-4H3,(H,30,35)/t17-,20-,21-,22-,25-,26-,27-,28-/m0/s1
Reactome pathway
n/an/an/an/a 117n/an/an/an/a
Merck Research Laboratories
Curated by ChEMBL
Assay Description
Transactivation activity of tyrosine amino transferase in rat H4 cells
Bioorg Med Chem 16: 7535-42 (2008)
Article DOI: 10.1016/j.bmc.2008.07.037
BindingDB Entry DOI: 10.7270/Q2CC10HX
Glucocorticoid receptor
(Homo sapiens (Human))
BDBM50272400
((8S,9R,10S,11S,13S,14S,16S,17R)-9-fluoro-11-hydrox...)
Show SMILES CCCCCNC(=O)O[C@@]1([C@@H](C)C[C@H]2[C@@H]3CCC4=CC(=O)C=C[C@]4(C)[C@@]3(F)[C@@H](O)C[C@]12C)C(=O)CO |r,c:21,t:17|
Show InChI InChI=1S/C28H40FNO6/c1-5-6-7-12-30-24(35)36-28(23(34)16-31)17(2)13-21-20-9-8-18-14-19(32)10-11-25(18,3)27(20,29)22(33)15-26(21,28)4/h10-11,14,17,20-22,31,33H,5-9,12-13,15-16H2,1-4H3,(H,30,35)/t17-,20-,21-,22-,25-,26-,27-,28-/m0/s1
n/an/a 2.10n/an/an/an/an/an/a
Merck Research Laboratories
Curated by ChEMBL
Assay Description
Inhibition of human glucocorticoid receptor
Bioorg Med Chem 16: 7535-42 (2008)
Article DOI: 10.1016/j.bmc.2008.07.037
BindingDB Entry DOI: 10.7270/Q2CC10HX