BDBM50272468 (8S,9R,10S,11S,13S,14S,16S,17R)-9-fluoro-11-hydroxy-17-(2-hydroxyacetyl)-10,13,16-trimethyl-3-oxo-6,7,8,9,10,11,12,13,14,15,16,17-dodecahydro-3H-cyclopenta[a]phenanthren-17-yl sec-butylcarbamate::CHEMBL526106
SMILES: CCC(C)NC(=O)O[C@@]1([C@@H](C)C[C@H]2[C@@H]3CCC4=CC(=O)C=C[C@]4(C)[C@@]3(F)[C@@H](O)C[C@]12C)C(=O)CO
InChI Key: InChIKey=SWXCTQZUPWVXAU-VKDLJDRASA-N
Data: 1 IC50  1 EC50
Activity Spreadsheet -- Enzyme Inhibition Constant Data from BindingDB
Found 2 hits for monomerid = 50272468
Trg + Lig
Ki
nM
ΔG°
kcal/mole
IC50
nM
Kd
nM
EC50/IC50
nM
koff
s-1
kon
M-1s-1
pHTemp
°C
Interstitial collagenase
(Homo sapiens (Human))
BDBM50272468
((8S,9R,10S,11S,13S,14S,16S,17R)-9-fluoro-11-hydrox...)
Show SMILES CCC(C)NC(=O)O[C@@]1([C@@H](C)C[C@H]2[C@@H]3CCC4=CC(=O)C=C[C@]4(C)[C@@]3(F)[C@@H](O)C[C@]12C)C(=O)CO |r,c:20,t:16|
Show InChI InChI=1S/C27H38FNO6/c1-6-16(3)29-23(34)35-27(22(33)14-30)15(2)11-20-19-8-7-17-12-18(31)9-10-24(17,4)26(19,28)21(32)13-25(20,27)5/h9-10,12,15-16,19-21,30,32H,6-8,11,13-14H2,1-5H3,(H,29,34)/t15-,16?,19-,20-,21-,24-,25-,26-,27-/m0/s1
Reactome pathway
n/an/an/an/a 0.800n/an/an/an/a
Merck Research Laboratories
Curated by ChEMBL
Assay Description
Inhibition of glucocorticoid-mediated human MMP1 expression in PMA stimulated A549 cells assessed as MMP1 protein level by ELISA
Bioorg Med Chem 16: 7535-42 (2008)
Article DOI: 10.1016/j.bmc.2008.07.037
BindingDB Entry DOI: 10.7270/Q2CC10HX
Glucocorticoid receptor
(Homo sapiens (Human))
BDBM50272468
((8S,9R,10S,11S,13S,14S,16S,17R)-9-fluoro-11-hydrox...)
Show SMILES CCC(C)NC(=O)O[C@@]1([C@@H](C)C[C@H]2[C@@H]3CCC4=CC(=O)C=C[C@]4(C)[C@@]3(F)[C@@H](O)C[C@]12C)C(=O)CO |r,c:20,t:16|
Show InChI InChI=1S/C27H38FNO6/c1-6-16(3)29-23(34)35-27(22(33)14-30)15(2)11-20-19-8-7-17-12-18(31)9-10-24(17,4)26(19,28)21(32)13-25(20,27)5/h9-10,12,15-16,19-21,30,32H,6-8,11,13-14H2,1-5H3,(H,29,34)/t15-,16?,19-,20-,21-,24-,25-,26-,27-/m0/s1
n/an/a 0.5n/an/an/an/an/an/a
Merck Research Laboratories
Curated by ChEMBL
Assay Description
Inhibition of human glucocorticoid receptor
Bioorg Med Chem 16: 7535-42 (2008)
Article DOI: 10.1016/j.bmc.2008.07.037
BindingDB Entry DOI: 10.7270/Q2CC10HX