BDBM50272478 2-((R)-1-(3,4-dichlorophenylsulfonyl)-3-oxo-1,2,3,4-tetrahydroquinoxalin-2-yl)-N-((R)-7-formylchroman-4-yl)acetamide::CHEMBL498489
SMILES: Clc1ccc(cc1Cl)S(=O)(=O)N1[C@H](CC(=O)N[C@@H]2CCOc3cc(C=O)ccc23)C(=O)Nc2ccccc12
InChI Key: InChIKey=RTKTTWJHMINNBF-NFBKMPQASA-N
Data: 1 KI  1 IC50
Activity Spreadsheet -- Enzyme Inhibition Constant Data from BindingDB
Found 2 hits for monomerid = 50272478
Trg + Lig
Ki
nM
ΔG°
kcal/mole
IC50
nM
Kd
nM
EC50/IC50
nM
koff
s-1
kon
M-1s-1
pHTemp
°C
Bradykinin B1 receptor
(Homo sapiens (Human))
BDBM50272478
(2-((R)-1-(3,4-dichlorophenylsulfonyl)-3-oxo-1,2,3,...)
Show SMILES Clc1ccc(cc1Cl)S(=O)(=O)N1[C@H](CC(=O)N[C@@H]2CCOc3cc(C=O)ccc23)C(=O)Nc2ccccc12 |r|
Show InChI InChI=1S/C26H21Cl2N3O6S/c27-18-8-6-16(12-19(18)28)38(35,36)31-22-4-2-1-3-21(22)30-26(34)23(31)13-25(33)29-20-9-10-37-24-11-15(14-32)5-7-17(20)24/h1-8,11-12,14,20,23H,9-10,13H2,(H,29,33)(H,30,34)/t20-,23-/m1/s1
57n/an/an/an/an/an/an/an/a
Amgen Inc.
Curated by ChEMBL
Assay Description
Displacement of [3H]DAK from human bradykinin B1 receptor expressed in CHO-D-/aequorin cells by rapid filtration technique
Bioorg Med Chem Lett 18: 4477-81 (2008)
Article DOI: 10.1016/j.bmcl.2008.07.055
BindingDB Entry DOI: 10.7270/Q2F76CCT
Bradykinin B1 receptor
(Homo sapiens (Human))
BDBM50272478
(2-((R)-1-(3,4-dichlorophenylsulfonyl)-3-oxo-1,2,3,...)
Show SMILES Clc1ccc(cc1Cl)S(=O)(=O)N1[C@H](CC(=O)N[C@@H]2CCOc3cc(C=O)ccc23)C(=O)Nc2ccccc12 |r|
Show InChI InChI=1S/C26H21Cl2N3O6S/c27-18-8-6-16(12-19(18)28)38(35,36)31-22-4-2-1-3-21(22)30-26(34)23(31)13-25(33)29-20-9-10-37-24-11-15(14-32)5-7-17(20)24/h1-8,11-12,14,20,23H,9-10,13H2,(H,29,33)(H,30,34)/t20-,23-/m1/s1
n/an/a 23n/an/an/an/an/an/a
Amgen Inc.
Curated by ChEMBL
Assay Description
Antagonist activity at human bradykinin B1 receptor expressed in CHO-D-/aequorin cells
Bioorg Med Chem Lett 18: 4477-81 (2008)
Article DOI: 10.1016/j.bmcl.2008.07.055
BindingDB Entry DOI: 10.7270/Q2F76CCT