BDBM50272531 4-(4-(2-(5-chloro-2-oxobenzo[d]oxazol-3(2H)-yl)acetyl)-3-(pyrrolidin-1-ylmethyl)piperazin-1-ylsulfonyl)benzoic acid::CHEMBL497667
SMILES: OC(=O)c1ccc(cc1)S(=O)(=O)N1CCN(C(CN2CCCC2)C1)C(=O)Cn1c2cc(Cl)ccc2oc1=O
InChI Key: InChIKey=NJOBGWJPAHNOPD-UHFFFAOYSA-N
Data: 1 EC50
Activity Spreadsheet -- Enzyme Inhibition Constant Data from BindingDB
Found 1 hit for monomerid = 50272531
Trg + Lig
Ki
nM
ΔG°
kcal/mole
IC50
nM
Kd
nM
EC50/IC50
nM
koff
s-1
kon
M-1s-1
pHTemp
°C
Kappa-type opioid receptor
(Homo sapiens (Human))
BDBM50272531
(4-(4-(2-(5-chloro-2-oxobenzo[d]oxazol-3(2H)-yl)ace...)
Show SMILES OC(=O)c1ccc(cc1)S(=O)(=O)N1CCN(C(CN2CCCC2)C1)C(=O)Cn1c2cc(Cl)ccc2oc1=O
Show InChI InChI=1S/C25H27ClN4O7S/c26-18-5-8-22-21(13-18)30(25(34)37-22)16-23(31)29-12-11-28(15-19(29)14-27-9-1-2-10-27)38(35,36)20-6-3-17(4-7-20)24(32)33/h3-8,13,19H,1-2,9-12,14-16H2,(H,32,33)
Reactome pathway
n/an/an/an/a 2.00E+3n/an/an/an/a
GlaxoSmithKline Pharmaceuticals
Curated by ChEMBL
Assay Description
Agonist activity at human kappa opioid receptor expressed in CHO-K1 cells by [35S]GTPgamma binding assay
Bioorg Med Chem Lett 18: 4470-3 (2008)
Article DOI: 10.1016/j.bmcl.2008.07.067
BindingDB Entry DOI: 10.7270/Q2TH8MHF