BDBM50272845 CHEMBL498133::N-[1-(3-Fluoro-benzyl)-1H-indazol-5-yl]-5-[morpholin-4-yliminomethyl]-pyrimidine-4,6-diamine
SMILES: Nc1ncnc(Nc2ccc3n(Cc4cccc(F)c4)ncc3c2)c1\C=N\N1CCOCC1
InChI Key: InChIKey=LTZADKANMDZUFP-XODNFHPESA-N
Data: 3 IC50
Activity Spreadsheet -- Enzyme Inhibition Constant Data from BindingDB
Found 3 hits for monomerid = 50272845
Trg + Lig
Ki
nM
ΔG°
kcal/mole
IC50
nM
Kd
nM
EC50/IC50
nM
koff
s-1
kon
M-1s-1
pHTemp
°C
Receptor tyrosine-protein kinase erbB-2
(Homo sapiens (Human))
BDBM50272845
(CHEMBL498133 | N-[1-(3-Fluoro-benzyl)-1H-indazol-5...)
Show SMILES Nc1ncnc(Nc2ccc3n(Cc4cccc(F)c4)ncc3c2)c1\C=N\N1CCOCC1
Show InChI InChI=1S/C23H23FN8O/c24-18-3-1-2-16(10-18)14-32-21-5-4-19(11-17(21)12-29-32)30-23-20(22(25)26-15-27-23)13-28-31-6-8-33-9-7-31/h1-5,10-13,15H,6-9,14H2,(H3,25,26,27,30)/b28-13+
n/an/a 7n/an/an/an/an/an/a
Johnson & Johnson Pharmaceutical Research and Development
Curated by ChEMBL
Assay Description
Inhibition of human ErbB2
Bioorg Med Chem Lett 18: 4615-9 (2008)
Article DOI: 10.1016/j.bmcl.2008.07.020
BindingDB Entry DOI: 10.7270/Q2XD11HN
Receptor tyrosine-protein kinase erbB-2
(Homo sapiens (Human))
BDBM50272845
(CHEMBL498133 | N-[1-(3-Fluoro-benzyl)-1H-indazol-5...)
Show SMILES Nc1ncnc(Nc2ccc3n(Cc4cccc(F)c4)ncc3c2)c1\C=N\N1CCOCC1
Show InChI InChI=1S/C23H23FN8O/c24-18-3-1-2-16(10-18)14-32-21-5-4-19(11-17(21)12-29-32)30-23-20(22(25)26-15-27-23)13-28-31-6-8-33-9-7-31/h1-5,10-13,15H,6-9,14H2,(H3,25,26,27,30)/b28-13+
n/an/a 83n/an/an/an/an/an/a
Johnson & Johnson Pharmaceutical Research and Development
Curated by ChEMBL
Assay Description
Inhibition of human ErB2 phosphorylation in human SKBR3 cells
Bioorg Med Chem Lett 18: 4615-9 (2008)
Article DOI: 10.1016/j.bmcl.2008.07.020
BindingDB Entry DOI: 10.7270/Q2XD11HN
Epidermal growth factor receptor
(Homo sapiens (Human))
BDBM50272845
(CHEMBL498133 | N-[1-(3-Fluoro-benzyl)-1H-indazol-5...)
Show SMILES Nc1ncnc(Nc2ccc3n(Cc4cccc(F)c4)ncc3c2)c1\C=N\N1CCOCC1
Show InChI InChI=1S/C23H23FN8O/c24-18-3-1-2-16(10-18)14-32-21-5-4-19(11-17(21)12-29-32)30-23-20(22(25)26-15-27-23)13-28-31-6-8-33-9-7-31/h1-5,10-13,15H,6-9,14H2,(H3,25,26,27,30)/b28-13+
n/an/a 16n/an/an/an/an/an/a
Johnson & Johnson Pharmaceutical Research and Development
Curated by ChEMBL
Assay Description
Inhibition of human EGFR expressed in SF9 cells
Bioorg Med Chem Lett 18: 4615-9 (2008)
Article DOI: 10.1016/j.bmcl.2008.07.020
BindingDB Entry DOI: 10.7270/Q2XD11HN