null
SMILES: Fc1cccc(c1)N1CCC(CC1)C(=O)Nc1ccc2OCC(=O)Nc2c1
InChI Key: InChIKey=OQBVUVUZTRKEGV-UHFFFAOYSA-N
Activity Spreadsheet -- Enzyme Inhibition Constant Data from BindingDB
Found 2 hits for monomerid = 50272858
Trg + Lig
Ki
nM
ΔG°
kcal/mole
IC50
nM
Kd
nM
EC50/IC50
nM
koff
s-1
kon
M-1s-1
pHTemp
°C
Transient receptor potential cation channel subfamily V member 1
(Homo sapiens (Human))
BDBM50272858
(1-(3-fluorophenyl)-N-(3-oxo-3,4-dihydro-2H-benzo[b...)
Show SMILES Fc1cccc(c1)N1CCC(CC1)C(=O)Nc1ccc2OCC(=O)Nc2c1
Show InChI InChI=1S/C20H20FN3O3/c21-14-2-1-3-16(10-14)24-8-6-13(7-9-24)20(26)22-15-4-5-18-17(11-15)23-19(25)12-27-18/h1-5,10-11,13H,6-9,12H2,(H,22,26)(H,23,25)
Reactome pathway
84n/an/an/an/an/an/an/an/a
Johnson & Johnson Pharmaceutical Research and Development
Curated by ChEMBL
Assay Description
Displacement of [3H]RTX from human TRPV1 receptor expressed in HEK293 cell membrane
Bioorg Med Chem Lett 18: 4569-72 (2008)
Article DOI: 10.1016/j.bmcl.2008.07.035
BindingDB Entry DOI: 10.7270/Q2154GV5
Transient receptor potential cation channel subfamily V member 1
(Homo sapiens (Human))
BDBM50272858
(1-(3-fluorophenyl)-N-(3-oxo-3,4-dihydro-2H-benzo[b...)
Show SMILES Fc1cccc(c1)N1CCC(CC1)C(=O)Nc1ccc2OCC(=O)Nc2c1
Show InChI InChI=1S/C20H20FN3O3/c21-14-2-1-3-16(10-14)24-8-6-13(7-9-24)20(26)22-15-4-5-18-17(11-15)23-19(25)12-27-18/h1-5,10-11,13H,6-9,12H2,(H,22,26)(H,23,25)
Reactome pathway
n/an/a 520n/an/an/an/an/an/a
Johnson & Johnson Pharmaceutical Research and Development
Curated by ChEMBL
Assay Description
Antagonist activity at human TRPV1 receptor assessed as inhibition of capsaicin-induced calcium flux by FLIPR
Bioorg Med Chem Lett 18: 4569-72 (2008)
Article DOI: 10.1016/j.bmcl.2008.07.035
BindingDB Entry DOI: 10.7270/Q2154GV5