BDBM50272993 1-[(3-chlorobenzene)sulfonyl]-3-[7-({[(3-chlorobenzene)sulfonyl]carbamoyl}amino)heptyl]urea::CHEMBL457189::N,N'-(heptane-1,7-diyldicarbamoyl)bis(3-chlorobenzenesulfonamide)
SMILES: Clc1cccc(c1)S(=O)(=O)NC(=O)NCCCCCCCNC(=O)NS(=O)(=O)c1cccc(Cl)c1
InChI Key: InChIKey=WYYQITAYQRQOJA-UHFFFAOYSA-N
Data: 2 IC50
PDB links: 1 PDB ID matches this monomer.
Activity Spreadsheet -- Enzyme Inhibition Constant Data from BindingDB
Found 2 hits for monomerid = 50272993
Trg + Lig
Ki
nM
ΔG°
kcal/mole
IC50
nM
Kd
nM
EC50/IC50
nM
koff
s-1
kon
M-1s-1
pHTemp
°C
Fructose-1,6-bisphosphatase 1 (FBPase)
(Homo sapiens (Human))
BDBM50272993
(1-[(3-chlorobenzene)sulfonyl]-3-[7-({[(3-chloroben...)
Show SMILES Clc1cccc(c1)S(=O)(=O)NC(=O)NCCCCCCCNC(=O)NS(=O)(=O)c1cccc(Cl)c1
Show InChI InChI=1S/C21H26Cl2N4O6S2/c22-16-8-6-10-18(14-16)34(30,31)26-20(28)24-12-4-2-1-3-5-13-25-21(29)27-35(32,33)19-11-7-9-17(23)15-19/h6-11,14-15H,1-5,12-13H2,(H2,24,26,28)(H2,25,27,29)
n/an/a 4n/an/an/an/an/an/a
F. Hoffmann-La Roche Ltd
Curated by ChEMBL
Assay Description
Inhibition of human liver fructose-1,6-bisphosphatase in presence of fructose-2,6-bisphosphate
Bioorg Med Chem Lett 18: 4708-12 (2008)
Article DOI: 10.1016/j.bmcl.2008.06.103
BindingDB Entry DOI: 10.7270/Q26W99W7
3D
3D Structure (crystal)
Fructose-1,6-bisphosphatase 1 (FBPase)
(Homo sapiens (Human))
BDBM50272993
(1-[(3-chlorobenzene)sulfonyl]-3-[7-({[(3-chloroben...)
Show SMILES Clc1cccc(c1)S(=O)(=O)NC(=O)NCCCCCCCNC(=O)NS(=O)(=O)c1cccc(Cl)c1
Show InChI InChI=1S/C21H26Cl2N4O6S2/c22-16-8-6-10-18(14-16)34(30,31)26-20(28)24-12-4-2-1-3-5-13-25-21(29)27-35(32,33)19-11-7-9-17(23)15-19/h6-11,14-15H,1-5,12-13H2,(H2,24,26,28)(H2,25,27,29)
n/an/a 9n/an/an/an/an/an/a
F. Hoffmann-La Roche Ltd
Curated by ChEMBL
Assay Description
Inhibition of human liver fructose-1,6-bisphosphatase
Bioorg Med Chem Lett 18: 4708-12 (2008)
Article DOI: 10.1016/j.bmcl.2008.06.103
BindingDB Entry DOI: 10.7270/Q26W99W7
3D
3D Structure (crystal)