BDBM50273167 (5-Trifluoromethylpyridin-2-yl)-[7-(3-trifluoromethylpyridin-2-yl)quinazolin-4-yl]amine::7-(3-(trifluoromethyl)pyridin-2-yl)-N-(5-(trifluoromethyl)pyridin-2-yl)quinazolin-4-amine::CHEMBL456571
SMILES: FC(F)(F)c1ccc(Nc2ncnc3cc(ccc23)-c2ncccc2C(F)(F)F)nc1
InChI Key: InChIKey=PTKLUWQABAPTOX-UHFFFAOYSA-N
Data: 2 IC50
Activity Spreadsheet -- Enzyme Inhibition Constant Data from BindingDB
Found 2 hits for monomerid = 50273167
Trg + Lig
Ki
nM
ΔG°
kcal/mole
IC50
nM
Kd
nM
EC50/IC50
nM
koff
s-1
kon
M-1s-1
pHTemp
°C
Transient receptor potential cation channel subfamily V member 1
(Homo sapiens (Human))
BDBM50273167
((5-Trifluoromethylpyridin-2-yl)-[7-(3-trifluoromet...)
Show SMILES FC(F)(F)c1ccc(Nc2ncnc3cc(ccc23)-c2ncccc2C(F)(F)F)nc1
Show InChI InChI=1S/C20H11F6N5/c21-19(22,23)12-4-6-16(28-9-12)31-18-13-5-3-11(8-15(13)29-10-30-18)17-14(20(24,25)26)2-1-7-27-17/h1-10H,(H,28,29,30,31)
Reactome pathway
n/an/a 0.850n/an/an/an/an/an/a
Neurogen Corporation
Curated by ChEMBL
Assay Description
Antagonist activity at human recombinant TRPV1 expressed in HEK293 cells assessed as inhibition of capsazepine-induced calcium mobilization by FLIPR ...
J Med Chem 53: 3330-48 (2010)
Article DOI: 10.1021/jm100051g
BindingDB Entry DOI: 10.7270/Q2474BTP
Transient receptor potential cation channel subfamily V member 1
(Homo sapiens (Human))
BDBM50273167
((5-Trifluoromethylpyridin-2-yl)-[7-(3-trifluoromet...)
Show SMILES FC(F)(F)c1ccc(Nc2ncnc3cc(ccc23)-c2ncccc2C(F)(F)F)nc1
Show InChI InChI=1S/C20H11F6N5/c21-19(22,23)12-4-6-16(28-9-12)31-18-13-5-3-11(8-15(13)29-10-30-18)17-14(20(24,25)26)2-1-7-27-17/h1-10H,(H,28,29,30,31)
Reactome pathway
n/an/a 2.5n/an/an/an/an/an/a
Neurogen Corporation
Curated by ChEMBL
Assay Description
Antagonist activity at human TRPV1 receptor assessed as inhibition of capsaicin-induced activation
Bioorg Med Chem Lett 18: 4573-7 (2008)
Article DOI: 10.1016/j.bmcl.2008.07.036
BindingDB Entry DOI: 10.7270/Q28P6099