BDBM50273186 CHEMBL456762::N-[(3Z)-1-Hexyl-7-methyl-2-oxo-1,2-dihydro-3H-indol-3-ylidene]benzohydrazide
SMILES: CCCCCCN1C(=O)C(=NNC(=O)c2ccccc2)c2cccc(C)c12
InChI Key: InChIKey=HJZZJIDUNVHIMF-UHFFFAOYSA-N
Data: 1 EC50
Activity Spreadsheet -- Enzyme Inhibition Constant Data from BindingDB
Found 1 hit for monomerid = 50273186
Trg + Lig
Ki
nM
ΔG°
kcal/mole
IC50
nM
Kd
nM
EC50/IC50
nM
koff
s-1
kon
M-1s-1
pHTemp
°C
Cannabinoid receptor 2
(Homo sapiens (Human))
BDBM50273186
(CHEMBL456762 | N-[(3Z)-1-Hexyl-7-methyl-2-oxo-1,2-...)
Show SMILES CCCCCCN1C(=O)C(=NNC(=O)c2ccccc2)c2cccc(C)c12 |w:10.10|
Show InChI InChI=1S/C22H25N3O2/c1-3-4-5-9-15-25-20-16(2)11-10-14-18(20)19(22(25)27)23-24-21(26)17-12-7-6-8-13-17/h6-8,10-14H,3-5,9,15H2,1-2H3,(H,24,26)
Reactome pathway
n/an/an/an/a 84n/an/an/an/a
The University of Texas M. D. Anderson Cancer Center
Curated by ChEMBL
Assay Description
Agonist activity at human CB2 receptor expressed in CHO cells by [35S]GTPgammaS assay
J Med Chem 51: 4932-47 (2008)
Article DOI: 10.1021/jm8002203
BindingDB Entry DOI: 10.7270/Q2X067ZQ