BDBM50273225 CHEMBL457836::N-[(3Z)-7-Chloro-1-hexyl-2-oxo-1,2-dihydro-3H-indol-3-ylidene]benzohydrazide
SMILES: CCCCCCN1C(=O)C(=NNC(=O)c2ccccc2)c2cccc(Cl)c12
InChI Key: InChIKey=SIELLYJORFCFRS-UHFFFAOYSA-N
Data: 1 EC50
Activity Spreadsheet -- Enzyme Inhibition Constant Data from BindingDB
Found 1 hit for monomerid = 50273225
Trg + Lig
Ki
nM
ΔG°
kcal/mole
IC50
nM
Kd
nM
EC50/IC50
nM
koff
s-1
kon
M-1s-1
pHTemp
°C
Cannabinoid receptor 2
(Homo sapiens (Human))
BDBM50273225
(CHEMBL457836 | N-[(3Z)-7-Chloro-1-hexyl-2-oxo-1,2-...)
Show SMILES CCCCCCN1C(=O)C(=NNC(=O)c2ccccc2)c2cccc(Cl)c12 |w:10.10|
Show InChI InChI=1S/C21H22ClN3O2/c1-2-3-4-8-14-25-19-16(12-9-13-17(19)22)18(21(25)27)23-24-20(26)15-10-6-5-7-11-15/h5-7,9-13H,2-4,8,14H2,1H3,(H,24,26)
Reactome pathway
n/an/an/an/a 646n/an/an/an/a
The University of Texas M. D. Anderson Cancer Center
Curated by ChEMBL
Assay Description
Agonist activity at human CB2 receptor expressed in CHO cells by [35S]GTPgammaS assay
J Med Chem 51: 4932-47 (2008)
Article DOI: 10.1021/jm8002203
BindingDB Entry DOI: 10.7270/Q2X067ZQ