BDBM50273226 CHEMBL458057::N-[(3Z)-5-Fluoro-1-hexyl-2-oxo-1,2-dihydro-3H-indol-3-ylidene]benzohydrazide
SMILES: CCCCCCN1C(=O)C(=NNC(=O)c2ccccc2)c2cc(F)ccc12
InChI Key: InChIKey=SIZWMXXVQDVFGE-UHFFFAOYSA-N
Data: 1 EC50
Activity Spreadsheet -- Enzyme Inhibition Constant Data from BindingDB
Found 1 hit for monomerid = 50273226
Trg + Lig
Ki
nM
ΔG°
kcal/mole
IC50
nM
Kd
nM
EC50/IC50
nM
koff
s-1
kon
M-1s-1
pHTemp
°C
Cannabinoid receptor 2
(Homo sapiens (Human))
BDBM50273226
(CHEMBL458057 | N-[(3Z)-5-Fluoro-1-hexyl-2-oxo-1,2-...)
Show SMILES CCCCCCN1C(=O)C(=NNC(=O)c2ccccc2)c2cc(F)ccc12 |w:10.10|
Show InChI InChI=1S/C21H22FN3O2/c1-2-3-4-8-13-25-18-12-11-16(22)14-17(18)19(21(25)27)23-24-20(26)15-9-6-5-7-10-15/h5-7,9-12,14H,2-4,8,13H2,1H3,(H,24,26)
Reactome pathway
n/an/an/an/a 187n/an/an/an/a
The University of Texas M. D. Anderson Cancer Center
Curated by ChEMBL
Assay Description
Agonist activity at human CB2 receptor expressed in CHO cells by [35S]GTPgammaS assay
J Med Chem 51: 4932-47 (2008)
Article DOI: 10.1021/jm8002203
BindingDB Entry DOI: 10.7270/Q2X067ZQ